Package Details: pick 2.0.1-1

Git Clone URL: https://aur.archlinux.org/pick.git (read-only)
Package Base: pick
Description: A fuzzy search tool for the command line
Upstream URL: https://github.com/calleerlandsson/pick
Licenses: MIT
Submitter: calleerlandsson
Maintainer: uffe
Last Packager: mis
Votes: 5
Popularity: 0.323641
First Submitted: 2015-08-10 12:08
Last Updated: 2018-01-23 14:09

Latest Comments

uffe commented on 2016-10-06 08:27

It works now - thanks :-)

calleerlandsson commented on 2016-10-04 15:56

Please try installing version 1.5.1, uffe.

calleerlandsson commented on 2016-10-04 07:59

Hey uffe, thanks for pointing that out.

I'll make an upstream release fixing the issue and update the package.

uffe commented on 2016-10-02 15:20

pick-1.5.0 does not build for me:

...
checking for library containing initscr... -lncursesw
checking that generated files are newer than configure... done
configure: creating ./config.status
config.status: creating Makefile
config.status: creating config.h
config.status: config.h is unchanged
config.status: executing depfiles commands
make all-am
make[1]: Entering directory '/tmp/yaourt-tmp-uj/aur-pick/src/pick-1.5.0'
make[1]: Leaving directory '/tmp/yaourt-tmp-uj/aur-pick/src/pick-1.5.0'
==> Starting check()...
make tests/pick-test
make[1]: Entering directory '/tmp/yaourt-tmp-uj/aur-pick/src/pick-1.5.0'
gcc -D_XOPEN_SOURCE=600 -march=x86-64 -mtune=generic -O2 -pipe -fstack-protector-strong -Wl,-O1,--sort-common,--as-needed,-z,relro -o tests/pick-test tests/tests_pick_test-pick-test.o -lncursesw
tests/tests_pick_test-pick-test.o: In function `main':
pick-test.c:(.text.startup+0xff): undefined reference to `errc'
collect2: error: ld returned 1 exit status
make[1]: *** [Makefile:628: tests/pick-test] Error 1
make[1]: Leaving directory '/tmp/yaourt-tmp-uj/aur-pick/src/pick-1.5.0'
make: *** [Makefile:1094: check-am] Error 2
make: Target 'check' not remade because of errors.

calleerlandsson commented on 2016-05-10 13:32

Hey agostonbarna, thanks for the feedback.

Could it be that you need to download the public key used to sign the tarball in order for makepkg to verify its integrity?

gpg --recv-key 24735DD835689C84

agostonbarna commented on 2016-05-09 19:38

It throws the following error during installation:
==> Verifying source file signatures with gpg...
pick-1.3.0.tar.gz ... FAILED (unknown public key 24735DD835689C84)
==> ERROR: One or more PGP signatures could not be verified!
:: failed to verify pick integrity