Package Details: pidgin-light 2.14.1-1

Git Clone URL: https://aur.archlinux.org/pidgin-light.git (read-only, click to copy)
Package Base: pidgin-light
Description: A light pidgin version: msn, jabber, irc supported protocols without gstreamer, tcl, tk, xscreensaver support.No video/voice. Includes finch
Upstream URL: http://pidgin.im/
Keywords: pidgin
Licenses: GPL
Conflicts: finch, libpurple, pidgin, pidgin-msn, pidin-light-msn
Provides: finch, libpurple, pidgin
Replaces: gaim
Submitter: None
Maintainer: funilrys
Last Packager: funilrys
Votes: 59
Popularity: 0.000177
First Submitted: 2008-09-07 15:57 (UTC)
Last Updated: 2020-12-06 12:00 (UTC)

Required by (118)

Sources (2)

Latest Comments

1 2 3 4 Next › Last »

kluwe commented on 2019-12-02 20:50 (UTC) (edited on 2019-12-02 20:52 (UTC) by kluwe)

/usr/include/glib-2.0/gobject/gparam.h:271:8: note: declared here 271 | struct _GParameter /* auxiliary structure for _setv() variants */ | ^~~~~~~~~~~ CCLD finch /sbin/ld: ./libgnt/.libs/libgnt.so: undefined reference to `_Py_Dealloc' /sbin/ld: ./libgnt/.libs/libgnt.so: undefined reference to `PyList_Insert' /sbin/ld: ./libgnt/.libs/libgnt.so: undefined reference to `PyUnicode_FromString' /sbin/ld: ./libgnt/.libs/libgnt.so: undefined reference to `PyErr_Print' /sbin/ld: ./libgnt/.libs/libgnt.so: undefined reference to `PySys_GetObject' /sbin/ld: ./libgnt/.libs/libgnt.so: undefined reference to `PyRun_SimpleFileExFlags' /sbin/ld: ./libgnt/.libs/libgnt.so: undefined reference to `Py_SetProgramName' /sbin/ld: ./libgnt/.libs/libgnt.so: undefined reference to `Py_Finalize' /sbin/ld: ./libgnt/.libs/libgnt.so: undefined reference to `Py_Initialize' /sbin/ld: ./libgnt/.libs/libgnt.so: undefined reference to `Py_IsInitialized' /sbin/ld: ./libgnt/.libs/libgnt.so: undefined reference to `PyErr_Occurred' collect2: error: ld returned 1 exit status make[3]: *** [Makefile:696: finch] Error 1 make[3]: Leaving directory '/home/arch/AUR/pidgin-light/src/pidgin-2.13.0/finch' make[2]: *** [Makefile:803: all-recursive] Error 1 make[2]: Leaving directory '/home/arch/AUR/pidgin-light/src/pidgin-2.13.0/finch' make[1]: *** [Makefile:641: all-recursive] Error 1 make[1]: Leaving directory '/home/arch/AUR/pidgin-light/src/pidgin-2.13.0' make: *** [Makefile:545: all] Error 2 ==> ERRO: Uma falha ocorreu em build(). Abortando...

someone with the same error? https://pastebin.com/RWaw88Uf

funilrys commented on 2016-11-14 20:48 (UTC)

Thanks @skunkos, Fixed ! For fast contact : https://gitter.im/funilrys_/PKGBUILD

skunkos commented on 2016-10-17 18:05 (UTC)

Solved by installing pkg-config, maybe it should be added to makedeps.

skunkos commented on 2016-10-17 17:57 (UTC)

Last version gives error: http://pastebin.com/BfMd1wLJ Probably some missing deps in PKGBUILD?

funilrys commented on 2016-10-06 20:39 (UTC)

Updated to v2.11.0 ! If there's a problem please let me know ! For fast contact : https://gitter.im/funilrys_/PKGBUILD

gbc921 commented on 2016-08-10 16:17 (UTC)

Please update version to 2.11.0 pkgver=2.11.0 I have build and it installs fine here (x64). Tks,

webdawg commented on 2016-05-24 04:14 (UTC)

How is anyone flagging this out of date when it is the git?

PedsXing commented on 2014-02-03 14:53 (UTC)

XMPP login issues are apparently fixed in 2.10.9: https://developer.pidgin.im/ticket/15879

PedsXing commented on 2014-02-02 21:44 (UTC)

XMPP has stopped working (does not log in) for me since the last update. Works with the same configuration and pidgin from [Extra].