Package Details: piedock 1.6.9-1

Git Clone URL: (read-only, click to copy)
Package Base: piedock
Description: A task bar and application launcher in shape of a circular pie menu.
Upstream URL:
Licenses: custom:MIT
Submitter: speps
Maintainer: bidulock
Last Packager: bidulock
Votes: 8
Popularity: 0.000000
First Submitted: 2011-02-03 11:12
Last Updated: 2020-07-02 10:22

Latest Comments

1 2 Next › Last »

0ion9 commented on 2014-01-12 00:05

@speps: okay, adopted, switched to sha256sums, fixed libpng1.6 support fully.

speps commented on 2014-01-11 04:25

Updated to 1.6.3-1
@0ion9 ok, take care of it for me, disowning.

0ion9 commented on 2014-01-08 23:36

I'm willing to adopt this, if you disown it.

Latest version is 1.6.3.

bidulock commented on 2013-05-11 01:53

Just click "Disown Package".

speps commented on 2013-04-14 01:34

Fix applied in piedock 1.6.1-2, thanks.
I'm not interested anymore in maintaining this, if someone else want to take over it let me know.

bidulock commented on 2013-04-13 03:04

sent a patch for same

Anonymous comment on 2013-02-03 11:02

unistd.h needs to be included in Application.cpp

triarius commented on 2012-06-10 07:39

More build logs:

In file included from WindowManager.cpp:14:0:
WindowManager.h: In constructor ‘PieDock::WindowManager::Property<T>::Property(Display*, Window, Atom, const char*)’:
WindowManager.h:86:22: warning: delegating constructors only available with -std=c++11 or -std=gnu++11 [enabled by default]
WindowManager.cpp: In static member function ‘static void PieDock::WindowManager::activate(Display*, Window)’:
WindowManager.cpp:95:16: error: ‘usleep’ was not declared in this scope
make[1]: *** [WindowManager.o] Error 1
make[1]: *** Waiting for unfinished jobs....
Environment.cpp: In static member function ‘static const string PieDock::Environment::getHome()’:
Environment.cpp:42:40: error: ‘getuid’ was not declared in this scope
make[1]: *** [Environment.o] Error 1
mv -f .deps/ModMask.Tpo .deps/ModMask.Po
make[1]: Leaving directory `/tmp/yaourt-tmp-narthana/aur-piedock/src/piedock-1.6.0/src'
make: *** [all-recursive] Error 1

Reded commented on 2012-06-07 05:25

Fails to build

make[1]: Leaving directory `/tmp/yaourt-tmp-eddie/aur-piedock/src/piedock-1.6.0/src'
make: *** [all-recursive] Error 1
==> ERROR: A failure occurred in build().
==> ERROR: Makepkg was unable to build piedock.
==> Restart building piedock ? [y/N]
==> --------------------------------

Any fixes available?

triarius commented on 2012-03-14 12:39