Package Details: plee-the-bear 0.7.0-1

Git Clone URL: https://aur.archlinux.org/plee-the-bear.git (read-only)
Package Base: plee-the-bear
Description: A classic 2D platform game - rescue your kidnapped son (to slap him).
Upstream URL: http://www.stuff-o-matic.com/plee-the-bear/?lang=en
Licenses: GPL, CCPL: by-sa
Submitter: Cilyan
Maintainer: carstene1ns
Last Packager: carstene1ns
Votes: 22
Popularity: 0.009002
First Submitted: 2008-01-07 00:10
Last Updated: 2015-07-08 03:27

Latest Comments

carstene1ns commented on 2014-03-17 18:45

Adopted and updated to latest version. I also enabled the editors which were disabled before (because they only build with wxgtk2.8).
It takes quite long to compile, so if you do just want to play you can disable them (see line #23 in the PKGBUILD).

Kivutar commented on 2012-05-08 17:55

It wont compile:

[ 22%] Building CXX object bear-engine/core/src/engine/CMakeFiles/bear_engine.dir/code/game_stats.cpp.o
In file included from /usr/include/claw/socket_stream.hpp:81:0,
from /tmp/packerbuild-1002/plee-the-bear/plee-the-bear/src/plee-the-bear-0.6.0-light/bear-engine/core/src/engine/code/game_stats.cpp:34:
/usr/include/claw/impl/socket_stream.tpp: In instantiation of ‘claw::net::basic_socket_stream<CharT, Traits>::basic_socket_stream(const char*, int, int) [with CharT = char; Traits = std::char_traits<char>]’:
/tmp/packerbuild-1002/plee-the-bear/plee-the-bear/src/plee-the-bear-0.6.0-light/bear-engine/core/src/engine/code/game_stats.cpp:104:53: required from here
/usr/include/claw/impl/socket_stream.tpp:58:3: erreur: ‘init’ was not declared in this scope, and no declarations were found by argument-dependent lookup at the point of instantiation [-fpermissive]
/usr/include/claw/impl/socket_stream.tpp:58:3: note: declarations in dependent base ‘std::basic_ios<char>’ are not found by unqualified lookup
/usr/include/claw/impl/socket_stream.tpp:58:3: note: use ‘this->init’ instead
In file included from /usr/include/claw/basic_socketbuf.hpp:109:0,
from /usr/include/claw/socket_stream.hpp:33,
from /tmp/packerbuild-1002/plee-the-bear/plee-the-bear/src/plee-the-bear-0.6.0-light/bear-engine/core/src/engine/code/game_stats.cpp:34:
/usr/include/claw/impl/basic_socketbuf.tpp: In instantiation of ‘int claw::net::basic_socketbuf<CharT, Traits>::sync() [with CharT = char; Traits = std::char_traits<char>]’:
/tmp/packerbuild-1002/plee-the-bear/plee-the-bear/src/plee-the-bear-0.6.0-light/bear-engine/core/src/engine/code/game_stats.cpp:149:1: required from here
/usr/include/claw/impl/basic_socketbuf.tpp:181:5: erreur: ‘setp’ was not declared in this scope, and no declarations were found by argument-dependent lookup at the point of instantiation [-fpermissive]
/usr/include/claw/impl/basic_socketbuf.tpp:181:5: note: declarations in dependent base ‘std::basic_streambuf<char>’ are not found by unqualified lookup
/usr/include/claw/impl/basic_socketbuf.tpp:181:5: note: use ‘this->setp’ instead
/usr/include/claw/impl/basic_socketbuf.tpp: In instantiation of ‘claw::net::basic_socketbuf<CharT, Traits>::int_type claw::net::basic_socketbuf<CharT, Traits>::underflow() [with CharT = char; Traits = std::char_traits<char>; claw::net::basic_socketbuf<CharT, Traits>::int_type = int]’:
/tmp/packerbuild-1002/plee-the-bear/plee-the-bear/src/plee-the-bear-0.6.0-light/bear-engine/core/src/engine/code/game_stats.cpp:149:1: required from here
/usr/include/claw/impl/basic_socketbuf.tpp:217:7: erreur: ‘setg’ was not declared in this scope, and no declarations were found by argument-dependent lookup at the point of instantiation [-fpermissive]
/usr/include/claw/impl/basic_socketbuf.tpp:217:7: note: declarations in dependent base ‘std::basic_streambuf<char>’ are not found by unqualified lookup
/usr/include/claw/impl/basic_socketbuf.tpp:217:7: note: use ‘this->setg’ instead
/usr/include/claw/impl/basic_socketbuf.tpp:221:5: erreur: ‘setg’ was not declared in this scope, and no declarations were found by argument-dependent lookup at the point of instantiation [-fpermissive]
/usr/include/claw/impl/basic_socketbuf.tpp:221:5: note: declarations in dependent base ‘std::basic_streambuf<char>’ are not found by unqualified lookup
/usr/include/claw/impl/basic_socketbuf.tpp:221:5: note: use ‘this->setg’ instead
/usr/include/claw/impl/basic_socketbuf.tpp: In instantiation of ‘claw::net::basic_socketbuf<CharT, Traits>::int_type claw::net::basic_socketbuf<CharT, Traits>::overflow(claw::net::basic_socketbuf<CharT, Traits>::int_type) [with CharT = char; Traits = std::char_traits<char>; claw::net::basic_socketbuf<CharT, Traits>::int_type = int]’:
/tmp/packerbuild-1002/plee-the-bear/plee-the-bear/src/plee-the-bear-0.6.0-light/bear-engine/core/src/engine/code/game_stats.cpp:149:1: required from here
/usr/include/claw/impl/basic_socketbuf.tpp:246:9: erreur: ‘sputc’ was not declared in this scope, and no declarations were found by argument-dependent lookup at the point of instantiation [-fpermissive]
/usr/include/claw/impl/basic_socketbuf.tpp:246:9: note: declarations in dependent base ‘std::basic_streambuf<char>’ are not found by unqualified lookup
/usr/include/claw/impl/basic_socketbuf.tpp:246:9: note: use ‘this->sputc’ instead
make[2]: *** [bear-engine/core/src/engine/CMakeFiles/bear_engine.dir/code/game_stats.cpp.o] Erreur 1
make[1]: *** [bear-engine/core/src/engine/CMakeFiles/bear_engine.dir/all] Erreur 2
make: *** [all] Erreur 2

hcartiaux commented on 2011-08-28 12:10

Release 0.6.0 is out :)

pkgver=0.6.0
md5sums=('53ec3a0153be8684c007a5da4efcd929')

MCMic commented on 2011-04-04 07:14

It won't compile : /tmp/yaourt-tmp-mcmic/aur-plee-the-bear/src/plee-the-bear-0.5.1/bear-engine/core/src/engine/code/game_local_client.cpp:362:71: erreur: no matching function for call to ‘boost::filesystem3::path::path(std::string&, bool (&)(const std::string&))’

feufochmar commented on 2010-09-12 22:02

0.4.1 does not compile (I tried to compile it with libclaw-svn as libclaw does not compile either)
[...]
[ 26%] Building CXX object bear-engine/core/src/engine/CMakeFiles/bear_engine.dir/code/compiled_file.o
/core/src/engine/code/compiled_file.cpp:149:1: erreur: ‘bear::engine::compiled_file::compiled_file’ names the constructor, not the type