Package Details: pokerth 1.1.2-4

Git Clone URL: https://aur.archlinux.org/pokerth.git (read-only)
Package Base: pokerth
Description: Client to online Poker game written in C++/QT
Upstream URL: http://www.pokerth.net/
Licenses: GPL, custom
Submitter: blacktav
Maintainer: blacktav
Last Packager: blacktav
Votes: 5
Popularity: 0.497145
First Submitted: 2018-01-08 23:25
Last Updated: 2018-08-07 22:20

Latest Comments

blacktav commented on 2018-08-07 22:26

bumped release to trigger rebuild with new protobuf

blacktav commented on 2018-08-07 12:32

dependency issue with libprotobuf

tilt commented on 2018-07-02 20:54

Thanks @blacktav: I managed to compile pokerth with no further errors :) I deleted my git folder and make a fresh git pull of the repo; then I made a makepkg -sic and the package was finally fine ;)

You've been very kind, thank you again!

blacktav commented on 2018-06-30 12:26

tilt: I tried to replicate your problem with a fresh build and could not. I think the error message you gave indicates a linker problem - were there error messages before the collect2:error in the build? Did your latest build download the tarball again and build from scratch? How are you building the package: manually or with a tool like pikaur? Perhaps there is a dependancy missing. Disk space ought to be fine and space would usually be consumed on /home I think

tilt commented on 2018-06-30 11:52

Just did a full-system upgrade: no luck, same error :( Maybe am I running out of space? Under / I have 1.5gb of free space and under /home 6gb.

blacktav commented on 2018-06-27 20:06

@tilt Is the rest of your system up-to-date? The source package is quite old and has not changed in ages so problems tend to be integration with other packages - the most recent being a change to boost

tilt commented on 2018-06-27 19:47

Hi, facing some problems compiling this package :(

collect2: error: ld returned 1 exit status make[1]: *** [Makefile.pokerth_game:583: pokerth] Error 1

make: *** [Makefile:132: sub-pokerth_game-pro-make_first-ordered] Error 2 ==> ERROR: A failure occurred in build(). Aborting...

Any advice? Thanks in advance :)

blacktav commented on 2018-06-09 22:02

bumped release after new boost demanded a rebuild; kudos OmidMnz