Package Details: polybar 3.3.1-2

Git Clone URL: (read-only)
Package Base: polybar
Description: A fast and easy-to-use status bar
Upstream URL:
Keywords: bar bspwm i3 lemonbar lemonbuddy polybar
Licenses: MIT
Conflicts: polybar-git
Submitter: jaagr
Maintainer: jaagr (NBonaparte, patrick96)
Last Packager: patrick96
Votes: 191
Popularity: 13.561016
First Submitted: 2016-11-19 05:09
Last Updated: 2019-06-23 19:24

Dependencies (21)

Required by (2)

Sources (1)

Pinned Comments

TheGreatAndyChow commented on 2019-04-23 03:46

For problems with conda, simply "conda deactivate", it will install. No need to purge path or remove anaconda.

Latest Comments

« First ‹ Previous ... 5 6 7 8 9 10 11 Next › Last »

jobu commented on 2016-12-25 22:13

I cannot update (and I don't understand if the problem is a conflict with freetype2):

[ 83%] Building CXX object bin/CMakeFiles/polybar.dir/x11/extensions/xkb.cpp.o
[ 84%] Building CXX object bin/CMakeFiles/polybar.dir/x11/fonts.cpp.o
In file included from /usr/include/freetype2/freetype/config/ftconfig.h:42:0,
from /usr/include/freetype2/freetype/freetype.h:33,
from /home/francesco/.cache/pacaur/polybar/src/polybar/include/x11/fonts.hpp:4,
from /home/francesco/.cache/pacaur/polybar/src/polybar/src/x11/fonts.cpp:10:
/usr/include/freetype2/freetype/config/ftoption.h:679:0: error: "TT_CONFIG_OPTION_SUBPIXEL_HINTING" redefined

/usr/include/freetype2/freetype/config/ftoption.h:678:0: note: this is the location of the previous definition

make[2]: *** [bin/CMakeFiles/polybar.dir/build.make:1671: bin/CMakeFiles/polybar.dir/x11/fonts.cpp.o] Error 1
make[1]: *** [CMakeFiles/Makefile2:334: bin/CMakeFiles/polybar.dir/all] Error 2
make: *** [Makefile:128: all] Error 2
==> ERRORE: Si è verificato un errore in build().
L'operazione sta per essere interrotta...
:: failed to build polybar package(s)

Thank you if you can help

jaagr commented on 2016-11-03 18:03

@edgard, @mrmackie: Should be fixed now.

And if you want mpd support you need to install libmpdclient (listed as an optional dependency)

edgard commented on 2016-11-03 16:32

same error as @mrmackie

mrmackie commented on 2016-11-03 16:09

Does not build successfully for me since last update.

Full build log as a gist:

harbinger commented on 2016-11-01 14:38

@jaagr Ah, that did it. Thanks!

jaagr commented on 2016-11-01 00:33

@harbinger: Install `wireless_tools` and rebuild the package to enable the network module. It's listed as an optional dependency.

harbinger commented on 2016-10-31 21:41

Apparently this compiles without network support so you can't display network information. Why?

CorePoint commented on 2016-06-29 21:37

Thank you too. :)

jaagr commented on 2016-06-29 03:20

@CorePoint: Thanks, it's fixed now.. Misplaced a sed call.

CorePoint commented on 2016-06-28 20:51

I get this error, when i try to compile.

"ImportError: No module named xcbgen.state"

I don't get this error, when i compile the lemonbuddy-git package though.