Package Details: punes 0.100-1

Git Clone URL: https://aur.archlinux.org/punes.git (read-only)
Package Base: punes
Description: Nintendo Entertaiment System emulator
Upstream URL: http://forums.nesdev.com/viewtopic.php?t=6928
Keywords: emulator nes nintendo
Licenses: GPL2
Submitter: Mashin
Maintainer: Mashin (FHorse)
Last Packager: Mashin
Votes: 12
Popularity: 0.003537
First Submitted: 2012-01-16 10:46
Last Updated: 2016-04-28 05:52

Latest Comments

shoober420 commented on 2016-06-18 17:41

Thank you so much!

Ineu commented on 2016-06-16 18:18

It works, thank you.

FHorse commented on 2016-06-15 17:42

With this patch the problem with GCC 6.1 is fixed:
https://dl.dropboxusercontent.com/u/21595068/punes_fix_gcc_6.patch
This fix is already committed:
https://github.com/punesemu/puNES/commit/99f3f334ce6e23545b2398aede0f6dbbb52600f9

Ineu commented on 2016-06-15 17:14

I have the same issue. GCC version 6.1.1-2.

FHorse commented on 2016-06-14 23:56

Which version of GCC you use?

shoober420 commented on 2016-06-13 21:21

This still fails to build, along with the git version. I get the same error as figue.

FHorse commented on 2016-05-24 10:43

Figue you can contact me at punes.development@gmail.com. I'll try to figure out what the problem is.

figue commented on 2016-05-10 19:40

Build fails... Any ideas?

g++ -DHAVE_CONFIG_H -I. -I../.. -D_FORTIFY_SOURCE=2 -march=x86-64 -mtune=generic -O2 -pipe -fstack-protector-strong -DWITH_OPENGL -DGLEW_STATIC -DRELEASE -DWITH_OPENGL_CG -D'COMPILED="05102016213744"' -Wall -ffast-math -I/build/punes/src/puNES-0.100/./src -I/build/punes/src/puNES-0.100/./src/gui -I/build/punes/src/puNES-0.100/./src/core -I/build/punes/src/puNES-0.100/./src/video/shaders -I/build/punes/src/puNES-0.100/./src/gui/linux -I/build/punes/src/puNES-0.100/./src/video/sdl -I/usr/include/qt/QtWidgets -I/usr/include/qt -I/usr/include/qt/QtGui -I/usr/include/qt -I/usr/include/qt/QtCore -I/usr/include/qt -I/usr/include/SDL -D_GNU_SOURCE=1 -D_REENTRANT -fmessage-length=0 -finline-functions --param inline-unit-growth=200 --param large-function-growth=500 -MT xBRZ/xbrz_wrap.o -MD -MP -MF $depbase.Tpo -c -o xBRZ/xbrz_wrap.o xBRZ/xbrz_wrap.cpp &&\
mv -f $depbase.Tpo $depbase.Po
xBRZ/xbrz.cpp: In function 'double {anonymous}::distRGB(uint32_t, uint32_t)':
xBRZ/xbrz.cpp:174:12: error: 'sqrt' is not a member of 'std'
return std::sqrt(square(r_diff) + square(g_diff) + square(b_diff));
^~~
xBRZ/xbrz.cpp: In function 'double {anonymous}::distYCbCr(uint32_t, uint32_t, double)':
xBRZ/xbrz.cpp:201:12: error: 'sqrt' is not a member of 'std'
return std::sqrt(square(lumaWeight * y) + square(c_b) + square(c_r));
^~~
xBRZ/xbrz.cpp: In constructor '{anonymous}::DistYCbCrBuffer::DistYCbCrBuffer()':
xBRZ/xbrz.cpp:237:44: error: 'sqrt' is not a member of 'std'
buffer[i] = static_cast<float>(std::sqrt(square(y) + square(c_b) + square(c_r)));
^~~
Makefile:387: recipe for target 'xBRZ/xbrz.o' failed
make[3]: *** [xBRZ/xbrz.o] Error 1
make[3]: *** Waiting for unfinished jobs....
make[3]: Leaving directory '/build/punes/src/puNES-0.100/src/c++'
Makefile:528: recipe for target 'all-recursive' failed
make[2]: *** [all-recursive] Error 1
make[2]: Leaving directory '/build/punes/src/puNES-0.100/src'
Makefile:394: recipe for target 'all-recursive' failed
make[1]: *** [all-recursive] Error 1
make[1]: Leaving directory '/build/punes/src/puNES-0.100'
Makefile:335: recipe for target 'all' failed
make: *** [all] Error 2
==> ERROR: A failure occurred in build().
Aborting...

fatmike commented on 2015-09-14 08:12

Checksums wrong

nagar commented on 2015-04-26 00:43

Thanks, It works fine for me, but please change md5sum in install build :) need to be updated, Thanks :)

All comments