Package Details: python-language-server 0.36.2-5

Git Clone URL: https://aur.archlinux.org/python-language-server.git (read-only, click to copy)
Package Base: python-language-server
Description: An implementation of the Language Server Protocol for Python
Upstream URL: https://github.com/palantir/python-language-server
Licenses: MIT
Submitter: Foxboron
Maintainer: Foxboron
Last Packager: Foxboron
Votes: 3
Popularity: 0.21
First Submitted: 2021-12-03 22:45 (UTC)
Last Updated: 2021-12-03 22:45 (UTC)

Latest Comments

Hi-Angel commented on 2022-02-20 18:52 (UTC)

Hello, I could not install the package today, because 7 tests failed. Here is the summary I found at the end of the output:

I had to comment out this line in PKGBUILD py.test -k 'not test_pyqt_completion and not test_snippet_parsing and not test_numpy_hover'.

pyls is unmaintained and has been continued as fork pylsp. You can use python-lsp-server instead.

It's not a drop-in replacement though. I doesn't work for me because it complains that mypy 0.931 is of too high version. What a weird thing to complain about. pyls-mypy just works™

iago-lito commented on 2021-12-16 07:06 (UTC)

Great, thanks :)

Viterzgir commented on 2021-12-15 19:38 (UTC) (edited on 2021-12-15 22:52 (UTC) by Viterzgir)

pyls is unmaintained and has been continued as fork pylsp. You can use python-lsp-server instead.

iago-lito commented on 2021-12-15 08:43 (UTC)

Hello, I could not install the package today, because 7 tests failed. Here is the summary I found at the end of the output:

=================================================================================== short test summary info ===================================================================================
FAILED test/plugins/test_completion.py::test_jedi_completion - AssertionError: assert 'isabs(path)' in ['isabs(s)', 'isdir(s)', 'isfile(path)', 'islink(path)', 'ismount(path)']
FAILED test/plugins/test_completion.py::test_jedi_completion_with_fuzzy_enabled - AssertionError: assert 'commonprefix(m)' == 'commonprefix(list)'
FAILED test/plugins/test_completion.py::test_multistatement_snippet - AssertionError: assert 'date()' == 'date(${1:yea..., ${3:day})$0'
FAILED test/plugins/test_pyflakes_lint.py::test_syntax_error_pyflakes - assert "expected ':'" == 'invalid syntax'
FAILED test/plugins/test_pylint_lint.py::test_syntax_error_pylint_py3 - assert False
FAILED test/plugins/test_pylint_lint.py::test_lint_free_pylint - AssertionError: assert not [{'code': 'W1514', 'message': '[unspecified-encoding] Using open without explicitly specifying a...
FAILED test/plugins/test_pylint_lint.py::test_per_file_caching - AssertionError: assert not [{'code': 'W1514', 'message': '[unspecified-encoding] Using open without explicitly specifying a...
=========================================================== 7 failed, 99 passed, 10 skipped, 3 deselected, 2329 warnings in 38.02s ============================================================