Package Details: python-llvmlite 0.30.0-1

Git Clone URL: https://aur.archlinux.org/python-llvmlite.git (read-only)
Package Base: python-llvmlite
Description: Lightweight LLVM python binding for writing JIT compilers
Upstream URL: https://github.com/numba/llvmlite
Licenses: BSD
Submitter: mschu
Maintainer: mschu
Last Packager: mschu
Votes: 23
Popularity: 0.59
First Submitted: 2014-12-29 17:23
Last Updated: 2019-10-11 08:41

Pinned Comments

mschu commented on 2019-10-27 15:03

Can anyone confirm if numba works for them with llvmlite patched like below?

I did a clean build for llvmlite+numba and "from numba import jit" gives an llvm error.

For now, the only workaround seems to not update & add in /etc/pacman.conf IgnorePkg = llvm llvm-libs

Latest Comments

« First ‹ Previous ... 2 3 4 5 6 7

abulak commented on 2015-10-02 11:21

I get the same error;

in /tmp/aur-python-llvmlite/src/llvmlite-0.7.0/ffi I run
make -f Makefile.linux

this is the output:

# static-libstdc++ avoids runtime dependencies on a
# particular libstdc++ version.
g++ -static-libstdc++ -shared -flto `llvm-config --cxxflags` -fno-rtti -g assembly.cpp bitcode.cpp core.cpp initfini.cpp module.cpp value.cpp executionengine.cpp transforms.cpp passmanagers.cpp targets.cpp dylib.cpp linker.cpp -o libllvmlite.so -flto `llvm-config --ldflags` -Wl,--exclude-libs=ALL `llvm-config --system-libs --libs all`
transforms.cpp:18:2: warning: extra ‘;’ [-Wpedantic]
};
^
targets.cpp:7:43: fatal error: llvm/Target/TargetLibraryInfo.h: No such file or directory
compilation terminated.
Makefile.linux:17: recipe for target 'libllvmlite.so' failed
make: *** [libllvmlite.so] Error 1

the headers are present on my system but in llvm/Analysis, not llvm/Target;
Is this some old cruft in my system (It happened to me once before)?

m

mschu commented on 2015-10-01 22:00

I can not reproduce this. Can you tell me what error message you get for "make -f Makefile.linux" in the build directory?

wendell commented on 2015-09-30 14:30

Building 0.7.0-1 failed:

targets.cpp:7:43: fatal error: llvm/Target/TargetLibraryInfo.h: No such file or directory
compilation terminated.
Makefile.linux:17: recipe for target 'libllvmlite.so' failed
make: *** [libllvmlite.so] Error 1
Traceback (most recent call last):
File "ffi/build.py", line 114, in <module>
main()
File "ffi/build.py", line 104, in main
main_posix('linux', '.so')
File "ffi/build.py", line 96, in main_posix
subprocess.check_call(['make', '-f', makefile])
File "/usr/lib/python3.4/subprocess.py", line 561, in check_call
raise CalledProcessError(retcode, cmd)
subprocess.CalledProcessError: Command '['make', '-f', 'Makefile.linux']' returned non-zero exit status 2
error: command '/usr/bin/python' failed with exit status 1
==> ERROR: A failure occurred in build().
Aborting...

boedybios commented on 2015-05-06 07:17

Thank you.
I just removed the llvm 3.5 and let yaourt find the required dependency (llvm3.5). It works now :)

mschu commented on 2015-05-05 15:02

added extra/llvm35 as a dependency instead of extra/llvm which is at 3.6

boedybios commented on 2015-05-05 14:56

error: target not found: llvm<3.6

Could you kindly give fix this issue? Thank you :)

ayr0 commented on 2015-01-14 18:48

This packages breaks with llvm 3.5.1 update in official repos.
Should the dependency be llvm >= 3.5.0?