Package Details: python-megasync-git v3.

Git Clone URL: (read-only)
Package Base: megasync-git
Description: Python Bindings for MEGASync. (GIT Version)
Upstream URL:
Licenses: custom:MEGA
Conflicts: python-megasync
Provides: python-megasync
Submitter: sl1pkn07
Maintainer: sl1pkn07
Last Packager: sl1pkn07
Votes: 14
Popularity: 0.416022
First Submitted: 2016-03-12 18:32
Last Updated: 2017-12-16 18:52

Latest Comments

eimis commented on 2017-11-03 02:13

According to devs here


need to be modified

for the lazy

adambot commented on 2017-10-05 19:15

will do -- thanks for the guidance!

sl1pkn07 commented on 2017-10-04 20:08

try with upstream bugtracker

adambot commented on 2017-10-04 20:04

i get the following error when i try to build:

In file included from control/CrashHandler.cpp:15:0:
google_breakpad/client/linux/handler/exception_handler.h:192:21: error: field ‘context’ has incomplete type ‘google_breakpad::ucontext’
struct ucontext context;
google_breakpad/client/linux/handler/exception_handler.h:192:12: note: forward declaration of ‘struct google_breakpad::ucontext’
struct ucontext context;
make: *** [Makefile:5282: CrashHandler.o] Error 1
==> ERROR: A failure occurred in build().
==> ERROR: Makepkg was unable to build megasync-git.

any help would be appreciated

sl1pkn07 commented on 2017-10-01 10:09

@greenbigfrog nothig to do here. reinstall and go (you need learn how git packages works)


sl1pkn07 commented on 2017-08-12 13:09

builds ok here (today)

prometheus commented on 2017-08-12 11:56

Fails to build:

{standard input}: Assembler messages:
{standard input}:100500: Warning: end of file not at end of a line; newline inserted
{standard input}:102186: Error: unknown pseudo-op: `.l'
{standard input}: Error: open CFI at the end of file; missing .cfi_endproc directive
g++: internal compiler error: Killed (program cc1plus)
Please submit a full bug report,
with preprocessed source if appropriate.
See <> for instructions.
make: *** [Makefile:3643: megaclient.o] Error 4
==> ERROR: A failure occurred in build().

==> ERROR: the build failed
-> Status
failed (1): megasync-cli-git

sl1pkn07 commented on 2017-04-16 20:39


try now

sl1pkn07 commented on 2017-04-16 19:27

with LC_ALL=C please

kyb commented on 2017-04-16 19:26

ошибка: не удалось завершить транзакцию (конфликтующие файлы)
/usr/bin/mega-cmd содержится и в 'fuse-megasync-git' и в 'megasync-cli-git'
/usr/bin/mega-exec содержится и в 'fuse-megasync-git' и в 'megasync-cli-git'
/usr/bin/mega-cmd содержится и в 'fuse-megasync-git' и в 'megasync-daemon-git'
/usr/bin/mega-exec содержится и в 'fuse-megasync-git' и в 'megasync-daemon-git'
/usr/bin/mega-cmd содержится и в 'megasync-cli-git' и в 'megasync-daemon-git'
/usr/bin/mega-exec содержится и в 'megasync-cli-git' и в 'megasync-daemon-git'
Обнаружены ошибки, пакеты не обновлены.
==> ВНИМАНИЕ: Ваши пакеты сохранены в /tmp/yaourt-tmp-kyb
==> ОШИБКА: невозможно обновить

All comments