Search Criteria
Package Details: python-shiboken2 5.15.16+3.1-2
Package Actions
Git Clone URL: | https://aur.archlinux.org/pyside2.git (read-only, click to copy) |
---|---|
Package Base: | pyside2 |
Description: | Python bindings for shiboken2 |
Upstream URL: | https://wiki.qt.io/Qt_for_Python |
Licenses: | LGPL-3.0-or-later |
Submitter: | arojas |
Maintainer: | envolution |
Last Packager: | envolution |
Votes: | 12 |
Popularity: | 0.74 |
First Submitted: | 2024-04-16 07:05 (UTC) |
Last Updated: | 2025-03-30 21:59 (UTC) |
Dependencies (3)
- pyside2AUR
- python (python37AUR, python311AUR, python310AUR)
- python-numpy (python-numpy-gitAUR, python-numpy1AUR, python-numpy-mkl-binAUR, python-numpy-mkl-tbbAUR, python-numpy-mklAUR)
Latest Comments
« First ‹ Previous 1 2 3 4 5 6
clickit commented on 2024-04-29 11:10 (UTC) (edited on 2024-04-29 11:10 (UTC) by clickit)
I'm also getting an error during pyside2 building:
[ 16%] Building CXX object sources/pyside2/PySide2/QtCore/CMakeFiles/QtCore.dir/PySide2/QtCore/qcalendar_wrapper.cpp.o [ 16%] Building CXX object sources/pyside2/PySide2/QtCore/CMakeFiles/QtCore.dir/PySide2/QtCore/qcalendar_yearmonthday_wrapper.cpp.o [ 16%] Building CXX object sources/pyside2/PySide2/QtCore/CMakeFiles/QtCore.dir/PySide2/QtCore/qrecursivemutex_wrapper.cpp.o [ 16%] Building CXX object sources/pyside2/PySide2/QtCore/CMakeFiles/QtCore.dir/PySide2/QtCore/qbytearray_frombase64result_wrapper.cpp.o [ 16%] Building CXX object sources/pyside2/PySide2/QtCore/CMakeFiles/QtCore.dir/glue/qeasingcurve_glue.cpp.o [ 16%] Linking CXX shared module ../QtCore.cpython-312-x86_64-linux-gnu.so [ 16%] Built target QtCore Segmentation fault make[2]: *** [sources/pyside2/PySide2/QtCore/CMakeFiles/QtCore_pyi.dir/build.make:70: sources/pyside2/PySide2/QtCore/CMakeFiles/QtCore_pyi] Error 1 make[1]: *** [CMakeFiles/Makefile2:1573: sources/pyside2/PySide2/QtCore/CMakeFiles/QtCore_pyi.dir/all] Error 2 make: *** [Makefile:136: all] Error 2 ==> ERROR: A failure occurred in build(). Aborting... -> error making: pyside2-exit status 4 -> Failed to install the following packages. Manual intervention is required: pyside2 - exit status 4
frankspace commented on 2024-04-29 00:07 (UTC)
Compilation is failing for me.
I also get a lot of messages stating "
Cannot find type entry
" for various things, including ""QFlags<LoadHint>"
", ""QQmlListProperty"
", and ""QSharedPointer"
", all of which should be findable because they are in packages I know are installed in the chroot.kino_t commented on 2024-04-28 04:44 (UTC)
Error log: https://github.com/arch4edu/cactus/actions/runs/8860200614
« First ‹ Previous 1 2 3 4 5 6