Package Details: python2-graph-tool 2.29-1

Git Clone URL: (read-only)
Package Base: python2-graph-tool
Description: A Python module for manipulation and statistical analysis of graphs
Upstream URL:
Keywords: graphs networks science
Licenses: GPL3
Submitter: muellner
Maintainer: count0
Last Packager: count0
Votes: 5
Popularity: 0.000000
First Submitted: 2012-12-06 00:31
Last Updated: 2019-07-14 14:40

Latest Comments

1 2 Next › Last »

count0 commented on 2018-06-12 09:48

The GCC compilation issue has been fixed.

paulmelis commented on 2018-06-12 08:45

With GCC 8 there's a compile error: Needs the commit mentioned in that issue at the bottom

fidbc commented on 2016-11-18 15:59

Issue is fixed in the newest version. Thanks!

count0 commented on 2016-11-13 07:24

Please try the newest version; the problem should be fixed.

fidbc commented on 2016-11-02 11:35

Hi count0,

Build seems to fail with new boost version. Please see [1] for output. Any help trying go work around this will be appreciated.



muellner commented on 2016-01-05 22:07

I am disowning the package since the author of graph-tool, Tiago de Paula Peixoto, agreed to maintain the package himself. Please don't adopt the package hastily; Tiago will shortly take care of it.

muellner commented on 2015-12-29 20:36

Thanks for the report. Fixed.

muellner commented on 2015-12-29 13:59

See here:

I'm working on this.

Cake commented on 2015-12-29 13:45

I hit the following error when I am installing the package. Any solutions?

In file included from /usr/include/c++/5.3.0/memory:79:0,
from /usr/include/boost/config/no_tr1/memory.hpp:21,
from /usr/include/boost/get_pointer.hpp:14,
from /usr/include/boost/python/object/pointer_holder.hpp:11,
from /usr/include/boost/python/to_python_indirect.hpp:10,
from /usr/include/boost/python/converter/arg_to_python.hpp:10,
from /usr/include/boost/python/call.hpp:15,
from /usr/include/boost/python/object_core.hpp:14,
from /usr/include/boost/python/object.hpp:9,
from ./../graph.hh:23,
from ./../graph_filtering.hh:21,
/usr/include/c++/5.3.0/functional:776:3: note: namespace std::placeholders { }
Makefile:521: recipe for target 'graph_hits.lo' failed
make[4]: *** [graph_hits.lo] Error 1
make[4]: Leaving directory '/tmp/yaourt-tmp-kccai/aur-python2-graph-tool/src/graph-tool-2.12/src/graph/centrality'
Makefile:731: recipe for target 'all-recursive' failed
make[3]: *** [all-recursive] Error 1
make[3]: Leaving directory '/tmp/yaourt-tmp-kccai/aur-python2-graph-tool/src/graph-tool-2.12/src/graph'
Makefile:407: recipe for target 'all-recursive' failed
make[2]: *** [all-recursive] Error 1
make[2]: Leaving directory '/tmp/yaourt-tmp-kccai/aur-python2-graph-tool/src/graph-tool-2.12/src'
Makefile:557: recipe for target 'all-recursive' failed
make[1]: *** [all-recursive] Error 1
make[1]: Leaving directory '/tmp/yaourt-tmp-kccai/aur-python2-graph-tool/src/graph-tool-2.12'
Makefile:465: recipe for target 'all' failed
make: *** [all] Error 2
==> ERROR: A failure occurred in build().

arefindk commented on 2015-05-08 18:47

Thank you @muellner, rebuilding works.