Package Details: python2-megasync-git v3.5.0.0.32.g5eb57c4f-1

Git Clone URL: https://aur.archlinux.org/megasync-git.git (read-only)
Package Base: megasync-git
Description: Python2 Bindings for MEGASync. (GIT Version)
Upstream URL: https://mega.co.nz/#sync
Licenses: custom:MEGA
Conflicts: python2-megasync
Provides: python2-megasync
Submitter: sl1pkn07
Maintainer: sl1pkn07
Last Packager: sl1pkn07
Votes: 14
Popularity: 0.001958
First Submitted: 2016-03-12 18:32
Last Updated: 2017-12-16 18:52

Latest Comments

1 2 Next › Last »

dreieck commented on 2018-11-28 23:33

@sl1pkn07: Submitted.

sl1pkn07 commented on 2018-11-28 14:31

https://github.com/meganz/MEGAsync/issues

dreieck commented on 2018-11-28 13:09

Fails to compile for me with:

make: Entering directory '/tmp/yaourt-tmp-felics/aur-fuse-megasync-git/src/build'
/bin/sh: -c: line 11: syntax error near unexpected token `|'
/bin/sh: -c: line 11: `echo "$py_files" |  | sed '$!N;$!N;$!N;$!N;$!N;$!N;$!N;s/\n/ /g' | sed '$!N;$!N;$!N;$!N;s/\n/ /g' | \'
make: *** [Makefile:2777: uninstall-pkgpythonPYTHON] Error 1
make: Leaving directory '/tmp/yaourt-tmp-felics/aur-fuse-megasync-git/src/build'
==> ERROR: A failure occurred in package_libmega-git().
    Aborting...

attila123 commented on 2018-11-25 11:39

This one was last updated almost a year ago, and is flagged out-of-date for 2 months now. https://aur.archlinux.org/packages/megasync/ seems to be up-to-date currently.

adambot commented on 2017-10-05 19:15

will do -- thanks for the guidance!

sl1pkn07 commented on 2017-10-04 20:08

try with upstream bugtracker

https://github.com/meganz/MEGAsync/issues
https://github.com/meganz/sdk/issues

adambot commented on 2017-10-04 20:04

i get the following error when i try to build:

In file included from control/CrashHandler.cpp:15:0:
google_breakpad/client/linux/handler/exception_handler.h:192:21: error: field ‘context’ has incomplete type ‘google_breakpad::ucontext’
struct ucontext context;
^~~~~~~
google_breakpad/client/linux/handler/exception_handler.h:192:12: note: forward declaration of ‘struct google_breakpad::ucontext’
struct ucontext context;
^~~~~~~~
make: *** [Makefile:5282: CrashHandler.o] Error 1
==> ERROR: A failure occurred in build().
Aborting...
==> ERROR: Makepkg was unable to build megasync-git.

any help would be appreciated

sl1pkn07 commented on 2017-10-01 10:09

@greenbigfrog nothig to do here. reinstall and go (you need learn how git packages works)

greetings

sl1pkn07 commented on 2017-08-12 13:09

builds ok here (today)

prometheus commented on 2017-08-12 11:56

Fails to build:

{standard input}: Assembler messages:
{standard input}:100500: Warning: end of file not at end of a line; newline inserted
{standard input}:102186: Error: unknown pseudo-op: `.l'
{standard input}: Error: open CFI at the end of file; missing .cfi_endproc directive
g++: internal compiler error: Killed (program cc1plus)
Please submit a full bug report,
with preprocessed source if appropriate.
See <https://bugs.archlinux.org/> for instructions.
make: *** [Makefile:3643: megaclient.o] Error 4
==> ERROR: A failure occurred in build().
Aborting...

==> ERROR: the build failed
-> Status
failed (1): megasync-cli-git