Package Details: python2-rsvg 2.32.0-17

Git Clone URL: https://aur.archlinux.org/python2-rsvg.git (read-only, click to copy)
Package Base: python2-rsvg
Description: Python bindings for librsvg
Upstream URL: http://www.gnome.org
Licenses: GPL, LGPL
Conflicts: python-rsvg
Replaces: python-rsvg
Submitter: SanskritFritz
Maintainer: ValHue
Last Packager: SanskritFritz
Votes: 11
Popularity: 0.000769
First Submitted: 2017-02-04 15:07 (UTC)
Last Updated: 2017-02-09 14:34 (UTC)

Latest Comments

dreieck commented on 2020-02-21 15:20 (UTC)

Error while retrieving sources:

==> Retrieving sources...
  -> Downloading gnome-python-desktop-2.32.0.tar.bz2...
--2020-02-21 16:19:30--  https://download.gnome.org/sources/gnome-python-desktop/2.32/gnome-python-desktop-2.32.0.tar.bz2
Loaded CA certificate '/etc/ssl/certs/ca-certificates.crt'
Resolving download.gnome.org (download.gnome.org)... 8.43.85.13, 8.43.85.14
Connecting to download.gnome.org (download.gnome.org)|8.43.85.13|:443... connected.
HTTP request sent, awaiting response... 503 Service Unavailable
2020-02-21 16:19:30 ERROR 503: Service Unavailable.

==> ERROR: Failure while downloading https://download.gnome.org/sources/gnome-python-desktop/2.32/gnome-python-desktop-2.32.0.tar.bz2
    Aborting...
==> ERROR: Makepkg was unable to build python2-rsvg.
==> Restart building python2-rsvg ? [y/N]

SanskritFritz commented on 2019-04-06 08:56 (UTC)

I'm not using this anymore, so I disown it along with AWN.

spontarelliam commented on 2019-04-05 09:50 (UTC)

Unable to compile.

note: pygtk-codegen-2.0 is deprecated, use pygobject-codegen-2.0 instead note: I will now try to invoke pygobject-codegen-2.0 in the same directory /usr/local/bin/pygtk-codegen-2.0: line 10: /usr/local/bin/pygobject-codegen-2.0: No such file or directory make[2]: *** [Makefile:594: rsvg.c] Error 127

guzzard commented on 2017-02-11 11:23 (UTC)

builds ok now! Thanks a lot!

kingcreole commented on 2017-02-09 23:01 (UTC)

thank you :) awesome, works for me :)

frankspace commented on 2017-02-09 15:07 (UTC)

I also had that problem, but release 17 now compiles fine for me. Thank you!

SanskritFritz commented on 2017-02-09 14:35 (UTC)

Fixed it I think, please test.

SanskritFritz commented on 2017-02-08 19:32 (UTC)

https://bbs.archlinux.org/viewtopic.php?id=222754

ingod commented on 2017-02-08 14:49 (UTC)

In file included from evo-ebook-environment.h:28:0, from evo-ebook-environment.c:19: /usr/include/evolution-data-server/libebook/e-book.h:23:2: Fehler: #error "Only <libebook/libebook.h> should be included directly." #error "Only <libebook/libebook.h> should be included directly." ^~~~~ In file included from /usr/include/evolution-data-server/libebook/e-book.h:37:0, from evo-ebook-environment.h:28, from evo-ebook-environment.c:19: /usr/include/evolution-data-server/libebook/e-book-view.h:23:2: Fehler: #error "Only <libebook/libebook.h> should be included directly." #error "Only <libebook/libebook.h> should be included directly." ^~~~~ In file included from /usr/include/evolution-data-server/libebook/e-book-view.h:35:0, from /usr/include/evolution-data-server/libebook/e-book.h:37, from evo-ebook-environment.h:28, from evo-ebook-environment.c:19: /usr/include/evolution-data-server/libebook/e-book-types.h:25:2: Fehler: #error "Only <libebook/libebook.h> should be included directly." #error "Only <libebook/libebook.h> should be included directly." ^~~~~ In file included from /usr/include/evolution-data-server/libebook/e-book.h:38:0, from evo-ebook-environment.h:28, from evo-ebook-environment.c:19: /usr/include/evolution-data-server/libebook/e-book-types.h:25:2: Fehler: #error "Only <libebook/libebook.h> should be included directly." #error "Only <libebook/libebook.h> should be included directly." ^~~~~ In file included from evo-ebook-environment.c:19:0: evo-ebook-environment.h:29:30: schwerwiegender Fehler: libebook/e-vcard.h: Datei oder Verzeichnis nicht gefunden #include <libebook/e-vcard.h> ^ Kompilierung beendet. make[2]: *** [Makefile:454: ebook_la-evo-ebook-environment.lo] Fehler 1 make[2]: Verzeichnis „/tmp/yaourt-tmp-dreamman/aur-python2-rsvg/src/gnome-python-desktop-2.32.0/evolution“ wird verlassen make[1]: *** [Makefile:511: all-recursive] Fehler 1 make[1]: Verzeichnis „/tmp/yaourt-tmp-dreamman/aur-python2-rsvg/src/gnome-python-desktop-2.32.0“ wird verlassen make: *** [Makefile:380: all] Fehler 2 ==> FEHLER: Ein Fehler geschah in build(). Breche ab... ==> FEHLER:Makepkg konnte python2-rsvg nicht erstellen. ==> Erstellen von python2-rsvg neu starten?[j/N]

ArnaudNux commented on 2017-02-07 21:40 (UTC)

In file included from evo-ebook-environment.h:28:0, from evo-ebook-environment.c:19: /usr/include/evolution-data-server/libebook/e-book.h:23:2: error: #error "Only <libebook/libebook.h> should be included directly." #error "Only <libebook/libebook.h> should be included directly." ^~~~~ In file included from /usr/include/evolution-data-server/libebook/e-book.h:37:0, from evo-ebook-environment.h:28, from evo-ebook-environment.c:19: /usr/include/evolution-data-server/libebook/e-book-view.h:23:2: error: #error "Only <libebook/libebook.h> should be included directly." #error "Only <libebook/libebook.h> should be included directly." ^~~~~ In file included from /usr/include/evolution-data-server/libebook/e-book-view.h:35:0, from /usr/include/evolution-data-server/libebook/e-book.h:37, from evo-ebook-environment.h:28, from evo-ebook-environment.c:19: /usr/include/evolution-data-server/libebook/e-book-types.h:25:2: error: #error "Only <libebook/libebook.h> should be included directly." #error "Only <libebook/libebook.h> should be included directly." ^~~~~ In file included from /usr/include/evolution-data-server/libebook/e-book.h:38:0, from evo-ebook-environment.h:28, from evo-ebook-environment.c:19: /usr/include/evolution-data-server/libebook/e-book-types.h:25:2: error: #error "Only <libebook/libebook.h> should be included directly." #error "Only <libebook/libebook.h> should be included directly." ^~~~~ In file included from evo-ebook-environment.c:19:0: evo-ebook-environment.h:29:30: fatal error: libebook/e-vcard.h: No such file or directory #include <libebook/e-vcard.h> ^ compilation terminated. make[2]: *** [Makefile:454: ebook_la-evo-ebook-environment.lo] Error 1 make[2]: Leaving directory '/home/arnaud/tempo/yaourt-tmp-arnaud/aur-python2-rsvg/src/gnome-python-desktop-2.32.0/evolution' make[1]: *** [Makefile:511: all-recursive] Error 1 make[1]: Leaving directory '/home/arnaud/tempo/yaourt-tmp-arnaud/aur-python2-rsvg/src/gnome-python-desktop-2.32.0' make: *** [Makefile:380: all] Error 2 ==> ERROR: A failure occurred in build(). Aborting... ==> ERROR: Makepkg was unable to build python2-rsvg. ==> Restart building python2-rsvg ? [y/N] ==> -------------------------------------

kingcreole commented on 2017-02-07 14:58 (UTC) (edited on 2017-02-07 15:05 (UTC) by kingcreole)

For me it also happens, i have testing active and an x64 archlinux, i downgraded librsvg just now, somehow i had a higher version active, but that wasn't the issue, maybe something something primusrun? i have an intel driver and an nvidia driver

SanskritFritz commented on 2017-02-06 20:02 (UTC)

Sorry guys, it builds here, and I have no clue what the problem might be.

killajoe commented on 2017-02-06 18:47 (UTC)

same here as guzzard ...

guzzard commented on 2017-02-05 10:17 (UTC)

Unable to build the package. In file included from evo-ebook-environment.h:28:0, from evo-ebook-environment.c:19: /usr/include/evolution-data-server/libebook/e-book.h:23:2: error: #error "Only <libebook/libebook.h> should be included directly." #error "Only <libebook/libebook.h> should be included directly." ^~~~~ In file included from /usr/include/evolution-data-server/libebook/e-book.h:37:0, from evo-ebook-environment.h:28, from evo-ebook-environment.c:19: /usr/include/evolution-data-server/libebook/e-book-view.h:23:2: error: #error "Only <libebook/libebook.h> should be included directly." #error "Only <libebook/libebook.h> should be included directly." ^~~~~ In file included from /usr/include/evolution-data-server/libebook/e-book-view.h:35:0, from /usr/include/evolution-data-server/libebook/e-book.h:37, from evo-ebook-environment.h:28, from evo-ebook-environment.c:19: /usr/include/evolution-data-server/libebook/e-book-types.h:25:2: error: #error "Only <libebook/libebook.h> should be included directly." #error "Only <libebook/libebook.h> should be included directly." ^~~~~ In file included from /usr/include/evolution-data-server/libebook/e-book.h:38:0, from evo-ebook-environment.h:28, from evo-ebook-environment.c:19: /usr/include/evolution-data-server/libebook/e-book-types.h:25:2: error: #error "Only <libebook/libebook.h> should be included directly." #error "Only <libebook/libebook.h> should be included directly." ^~~~~ In file included from evo-ebook-environment.c:19:0: evo-ebook-environment.h:29:30: fatal error: libebook/e-vcard.h: No such file or directory #include <libebook/e-vcard.h> ^ compilation terminated. make[2]: *** [Makefile:454: ebook_la-evo-ebook-environment.lo] Error 1 make[2]: Leaving directory '/tmp/yaourt-tmp-guzzard/aur-python2-rsvg/src/gnome-python-desktop-2.32.0/evolution' make[1]: *** [Makefile:511: all-recursive] Error 1 make[1]: Leaving directory '/tmp/yaourt-tmp-guzzard/aur-python2-rsvg/src/gnome-python-desktop-2.32.0' make: *** [Makefile:380: all] Error 2