Package Details: qt3 1:3.3.8b-12

Git Clone URL: https://aur.archlinux.org/qt3.git (read-only)
Package Base: qt3
Description: A cross-platform application and UI framework
Upstream URL: http://qt.io
Licenses: GPL
Submitter: McNoggins
Maintainer: zoe
Last Packager: zoe
Votes: 46
Popularity: 0.001374
First Submitted: 2014-05-30 03:06
Last Updated: 2018-05-01 21:13

Sources (8)

Latest Comments

Nano commented on 2018-06-18 20:22

Hello.

I get this error:

g++: error: unrecognized command line option ‘-fno-plt’ make: *** [Makefile:170: project.o] Error 1 qmake failed to build. Aborting.

Please, help.

slav commented on 2018-05-01 23:14

@zoe Thank you very much for quick fixing!

chrko commented on 2018-05-01 21:42

@zoe: Sorry, messed up with markup! It builds perfectly fine again out of your PKGBUILD :)

zoe commented on 2018-05-01 21:17

@chrko and @slav : Sorry, I read too fast your patch, chrko. So I added the line :

   -I/usr/include/tirpc \

to ./configure, and it builds fine.

Thanks

slav commented on 2018-05-01 20:07

the same here:

In file included from dialogs/qprintdialog.cpp:75:0: /usr/include/rpcsvc/yp_prot.h:10:10: fatal error: rpc/rpc.h: No such file or directory #include <rpc rpc.h=""> ^~~~~~~~~~~ compilation terminated. make[2]: [Makefile:10480: .obj/release-shared-mt/qprintdialog.o] Error 1 make[2]: Leaving directory '/tmp/packerbuild-1000/qt3/qt3/src/qt-x11-free-3.3.8b/src' make[1]: [Makefile:40: sub-src] Error 2 make[1]: Leaving directory '/tmp/packerbuild-1000/qt3/qt3/src/qt-x11-free-3.3.8b' make: *** [Makefile:8: init] Error 2 ==> ERROR: A failure occurred in build(). Aborting... The build failed.</rpc>

zoe commented on 2018-05-01 19:55

@chrko : I added libnsl & libtirpc as dependencies (pkgrel=11) But, although these packages were already installed, qt3 fails to build :

 In file included from dialogs/qprintdialog.cpp:75:0:
 /usr/include/rpcsvc/yp_prot.h:10:10: erreur fatale: rpc/rpc.h : Aucun fichier ou dossier de ce type
    #include <rpc/rpc.h>
             ^~~~~~~~~~~
   compilation terminée.

I installed rpcsvc-proto from [extra], but that did not help, I got exactly the same error.

Any idea ?

chrko commented on 2018-05-01 17:06

The package needs the new dependencies libnsl & libtirpc to continue building with nis support :( Also + -I/usr/include/tirpc \ in the configure command.

nik123true commented on 2016-10-30 20:44

Just a simple issue, add patch to the dependencies.

xavery commented on 2016-05-18 19:27

@WoefulDerelict : not actually a Qt3 bug. I left a comment in the Gist.

McNoggins commented on 2016-05-16 17:26

Going to disown, as I'm not using it anymore.

All comments