Package Details: r-catools 1.17.1-1

Git Clone URL: https://aur.archlinux.org/r-catools.git (read-only)
Package Base: r-catools
Description: Moving (rolling, running) window statistic functions, read/write for GIF and ENVI binary files, fast calculation of AUC, LogitBoost classifier, base64 encoder/decoder, round-off-error-free sum and cumsum, etc.
Upstream URL: http://cran.r-project.org/web/packages/caTools/index.html
Licenses: GPL3
Submitter: sauliusl
Maintainer: sauliusl
Last Packager: sauliusl
Votes: 4
Popularity: 0.000000
First Submitted: 2015-03-24 14:20
Last Updated: 2015-08-05 10:45

Latest Comments

Anonymous comment on 2018-06-13 21:32

This is missing r-bitops as a dependency

sauliusl commented on 2016-06-15 16:08

see r-cran-catools instead https://aur.archlinux.org/packages/r-cran-catools/

KenjiTakahashi commented on 2012-10-16 17:04

Well, it seems to work fine here, couldn't get it to fail.
The error message says something about wrong declaration in string.h, but gcc messages are not very helpful :C.

KenjiTakahashi commented on 2012-10-15 01:17

But it doesn't mean it's out of date...
Anyway, I'll look into it.

burntsushi commented on 2012-10-14 19:08

This doesn't build.

* installing *source* package ‘caTools’ ...
** package ‘caTools’ successfully unpacked and MD5 sums checked
** libs
g++ -I/usr/include/R/ -DNDEBUG -I/usr/local/include -fpic -march=x86-64 -mtune=generic -O2 -pipe -fstack-protector --param=ssp-buffer-size=4 -D_FORTIFY_SOURCE=2 -c Gif2R.cpp -o Gif2R.o
g++ -I/usr/include/R/ -DNDEBUG -I/usr/local/include -fpic -march=x86-64 -mtune=generic -O2 -pipe -fstack-protector --param=ssp-buffer-size=4 -D_FORTIFY_SOURCE=2 -c GifTools.cpp -o GifTools.o
gcc -std=gnu99 -I/usr/include/R/ -DNDEBUG -I/usr/local/include -fpic -march=x86-64 -mtune=generic -O2 -pipe -fstack-protector --param=ssp-buffer-size=4 -D_FORTIFY_SOURCE=2 -c runfunc.c -o runfunc.o
In file included from /usr/include/R/R_ext/RS.h:24:0,
from /usr/include/R/R.h:44,
from runfunc.c:48:
/usr/include/string.h:451:13: error: expected declaration specifiers or ‘...’ before ‘(’ token
/usr/include/string.h:451:13: error: expected declaration specifiers or ‘...’ before ‘(’ token
/usr/include/string.h:451:13: error: expected declaration specifiers or ‘...’ before ‘(’ token
make: *** [runfunc.o] Error 1
ERROR: compilation failed for package ‘caTools’