Package Details: rfdump 1.6-2

Git Clone URL: https://aur.archlinux.org/rfdump.git (read-only)
Package Base: rfdump
Description: Tool to detect RFID-Tags and show their meta information
Upstream URL: http://www.rfdump.org
Licenses: GPL
Submitter: BlueIcefield
Maintainer: giovanni
Last Packager: giovanni
Votes: 7
Popularity: 0.000000
First Submitted: 2009-12-06 22:14
Last Updated: 2015-06-09 12:17

Dependencies (1)

Required by (0)

Sources (1)

Latest Comments

Anonymous comment on 2013-03-08 11:40

It builds successful with setting:
export LDFLAGS="-lexpat"

in PKGBUILD

pls, update

Fallback commented on 2012-09-19 23:03

same error as m4thu

I used this PKGBUILD
http://pastie.org/4756430

Anonymous comment on 2012-01-08 23:41

I get the same error as m4thu. And you should replace $startdir/src by ${srcdir} and $startdir/pkg by ${pkgdir}. The "|| return 1" can also be removed from the PKGBUILD.

Anonymous comment on 2011-12-25 09:19

Revice error:

make[2]: Entering directory `/tmp/yaourt-tmp-root/aur-rfdump/src/rfdump-1.6/src'
gcc -Wall -O2 -DVERSION=\"1.6\" -Wl,-O1,--sort-common,--as-needed,-z,relro,--hash-style=gnu -o rfdump -rdynamic main.o callbacks.o mifare.o rfid.o tagtypes.o xml.o acg.o tcpconnect.o -pthread -lgtk-x11-2.0 -lgdk-x11-2.0 -latk-1.0 -lgio-2.0 -lpangoft2-1.0 -lpangocairo-1.0 -lgdk_pixbuf-2.0 -lcairo -lpango-1.0 -lfreetype -lfontconfig -lgobject-2.0 -lgmodule-2.0 -lgthread-2.0 -lrt -lglib-2.0 -pthread -lglade-2.0 -lgtk-x11-2.0 -lxml2 -lgdk-x11-2.0 -latk-1.0 -lgio-2.0 -lpangoft2-1.0 -lpangocairo-1.0 -lgdk_pixbuf-2.0 -lcairo -lpango-1.0 -lfreetype -lfontconfig -lgobject-2.0 -lgmodule-2.0 -lgthread-2.0 -lrt -lglib-2.0
/usr/bin/ld: tagtypes.o: undefined reference to symbol 'XML_SetCharacterDataHandler'
/usr/bin/ld: note: 'XML_SetCharacterDataHandler' is defined in DSO /usr/lib/libexpat.so.1 so try adding it to the linker command line
/usr/lib/libexpat.so.1: could not read symbols: Invalid operation
collect2: ld gab 1 als Ende-Status zurück
make[2]: *** [rfdump] Fehler 1
make[2]: Leaving directory `/tmp/yaourt-tmp-root/aur-rfdump/src/rfdump-1.6/src'
make[1]: *** [all-recursive] Fehler 1
make[1]: Leaving directory `/tmp/yaourt-tmp-root/aur-rfdump/src/rfdump-1.6'
make: *** [all] Fehler 2