Package Details: rigsofrods-git 0.4.7.0.r285.gc37e6b5f-1

Git Clone URL: https://aur.archlinux.org/rigsofrods-git.git (read-only, click to copy)
Package Base: rigsofrods-git
Description: An open source vehicle simulator based on soft-body physics
Upstream URL: http://rigsofrods.org
Licenses: GPL
Conflicts: rigsofrods, rigsofrods-hg, rigsofrods-noangelscript-git
Provides: rigsofrods
Submitter: vorot93
Maintainer: None
Last Packager: Jeanbon
Votes: 4
Popularity: 0.000000
First Submitted: 2015-04-19 22:35
Last Updated: 2018-01-17 21:54

Dependencies (12)

Required by (0)

Sources (7)

Latest Comments

« First ‹ Previous 1 2 3 4 5 Next › Last »

tritonas00 commented on 2016-04-28 23:51

Latest ror upstream is boost-free and ogre from repo use boost. This will be fixed soon.

gururise commented on 2016-04-28 15:42

@Jeanbon boost-1.60.0-4 and caelum-git-r20.b33ce46-1 are both installed. I just rebuilt caelum from aur and I still get the same error when building RoR.

Jeanbon commented on 2016-04-28 07:13

@gururise Do you have boost installed ? Rigofrods depends of caelum-git which depends of boost. Both are installed on your system ? Which version ?

gururise commented on 2016-04-27 20:09

Now that the socketw problem is resolved, this is the error I am now getting:
/usr/bin/ld: CMakeFiles/RoR.dir/main.cpp.o: undefined reference to symbol '_ZN5boost6system15system_categoryEv'
/usr/lib/libboost_system.so.1.60.0: error adding symbols: DSO missing from command line
collect2: error: ld returned 1 exit status
source/main/CMakeFiles/RoR.dir/build.make:5206: recipe for target 'bin/RoR' failed
make[2]: *** [bin/RoR] Error 1
CMakeFiles/Makefile2:201: recipe for target 'source/main/CMakeFiles/RoR.dir/all' failed
make[1]: *** [source/main/CMakeFiles/RoR.dir/all] Error 2
Makefile:83: recipe for target 'all' failed
make: *** [all] Error 2

gururise commented on 2016-04-27 17:58

@Jeanbon looks like the socketw was the problem. There are problems with the socketw in AUR. I've fixed the problems with a new PKGBUILD for socketw that I created and submitted.

Jeanbon commented on 2016-04-25 07:25

Nop, do you have socketw installed from aur ? Which version do you have ?

gururise commented on 2016-04-22 16:32

Anyone else having this problem at the linking stage.... the entire compile works fine, just fails at the end when linking...

[ 97%] Linking CXX executable ../../bin/RoR
CMakeFiles/RoR.dir/network/Network.cpp.o: In function `Network::connect()':
Network.cpp:(.text+0x3091): undefined reference to `SWInetSocket::connect(int, std::__cxx11::basic_string<char, std::char_traits<char>, std::allocator<char> >, SWBaseSocket::SWBaseError*)'
collect2: error: ld returned 1 exit status
source/main/CMakeFiles/RoR.dir/build.make:6352: recipe for target 'bin/RoR' failed
make[2]: *** [bin/RoR] Error 1
CMakeFiles/Makefile2:201: recipe for target 'source/main/CMakeFiles/RoR.dir/all' failed
make[1]: *** [source/main/CMakeFiles/RoR.dir/all] Error 2
Makefile:83: recipe for target 'all' failed
make: *** [all] Error 2

tritonas00 commented on 2016-01-25 16:38

please change ogre-pagedgeometry (no such package) to ogre-pagedgeometry-git

tritonas00 commented on 2016-01-05 17:59

/opt/rigsofrods/RoRConfig
/opt/rigsofrods/RoR

ke7ofi commented on 2016-01-05 17:23

What's the executable called?