Package Details: rlvm 0.14-2

Git Clone URL: https://aur.archlinux.org/rlvm.git (read-only)
Package Base: rlvm
Description: RealLive clone for Linux and OSX
Upstream URL: http://www.elliotglaysher.org/rlvm/
Licenses: GPL
Submitter: sn4kebite
Maintainer: sn4kebite
Last Packager: sn4kebite
Votes: 7
Popularity: 0.000000
First Submitted: 2010-04-12 21:19
Last Updated: 2015-06-08 16:41

Latest Comments

carstene1ns commented on 2017-04-01 02:48

The old page has been moved to a dedicated domain: http://www.rlvm.net/

noogar commented on 2017-03-30 16:07

upstream url do not work,
ERROR 404
take https://github.com/eglaysher/rlvm/releases

kettle commented on 2015-01-10 22:04

This fails to build, but the workaround by alex85k here: https://github.com/luabind/luabind/issues/27 fixes it.

carstene1ns commented on 2014-07-24 07:09

There has actually been a bugfix release to 0.13, would be nice if you could update to version 0.13.1... Thanks!

sn4kebite commented on 2013-10-15 12:41

FYI I won't be able to update this package until Sunday (not home this week and don't have my laptop with me).

nasedo commented on 2013-02-08 09:26

Compiling build/release/src/Systems/Base/TextPage.o ...
In file included from src/Systems/Base/TextPage.cpp:28:0:
src/Systems/Base/TextPage.hpp:49:44: error: expected class-name before '{' token
Compiling build/release/src/Systems/Base/TextSystem.o ...
scons: *** [build/release/src/Systems/Base/TextPage.o] Error 1
scons: building terminated because of errors.
==> ERROR: A failure occurred in build().

sn4kebite commented on 2012-12-14 17:45

Updated with some patches to fix the build errors.

chaserhkj commented on 2012-12-14 07:52

Bug report...

Compile error in build()

makepkg messages:
======Messages Start======
==> Making package: rlvm 0.12-2 (Fri Dec 14 15:47:51 CST 2012)
==> Checking runtime dependencies...
==> Checking buildtime dependencies...
==> Retrieving Sources...
-> Found release-0.12
-> Found build.patch
-> Found boost_filesystem_v3.patch
==> Validating source files with md5sums...
release-0.12 ... Passed
build.patch ... Passed
boost_filesystem_v3.patch ... Passed
==> Extracting Sources...
-> Extracting release-0.12 with bsdtar
bsdtar: Failed to set default locale
==> Removing existing pkg/ directory...
==> Entering fakeroot environment...
==> Starting build()...
patching file SConstruct
patching file SConstruct
patching file src/MachineBase/RLVMInstance.cpp
patching file src/MachineBase/SerializationGlobal.cpp
patching file src/Modules/Module_Sys_Save.cpp
patching file src/Systems/Base/GraphicsSystem.cpp
Hunk #1 succeeded at 724 (offset -42 lines).
patching file src/Systems/Base/KOEPACVoiceArchive.cpp
patching file src/Systems/Base/NWKVoiceArchive.cpp
patching file src/Systems/Base/OVKVoiceSample.cpp
patching file src/Systems/Base/System.cpp
patching file src/Systems/Base/VoiceCache.cpp
patching file src/Systems/SDL/SDLGraphicsSystem.cpp
patching file src/Systems/SDL/SDLMusic.cpp
patching file src/Systems/SDL/SDLSoundChunk.cpp
patching file src/Systems/SDL/SDLTextSystem.cpp
patching file src/Utilities/File.cpp
patching file src/libReallive/archive.cpp
patching file vendor/wxInclude.cpp
scons: Reading SConscript files ...
Checking for Boost version >= 1.40... (cached) yes
Checking for C library pthread... (cached) yes
Checking for C library ogg... (cached) yes
Checking for C library vorbis... (cached) yes
Checking for C library vorbisfile... (cached) yes
Checking for C library SDL... (cached) yes
Checking for glewInit() in C++ library GLEW... (cached) yes
Checking for TTF_Init() in C++ library SDL_ttf... (cached) yes
Checking for C++ library SDL_mixer... (cached) yes
Checking for C++ library SDL_image... (cached) yes
Checking for guichan 0.8 with OpenGL and SDL support...(cached) no
(Using included copy of guichan)
Checking for C++ library png... (cached) yes
Checking for C++ library jpeg... (cached) no
Checking for C++ library mad... (cached) yes
Checking for C++ library lua5.1... (cached) yes
scons: done reading SConscript files.
scons: Building targets ...
scons: building associated VariantDir targets: build/release
Compiling build/release/build/libraries/luabind/src/class.o ...
Compiling build/release/build/libraries/luabind/src/class_info.o ...
Compiling build/release/build/libraries/luabind/src/class_registry.o ...
Compiling build/release/build/libraries/luabind/src/class_rep.o ...
Compiling build/release/build/libraries/luabind/src/create_class.o ...
In file included from vendor/luabind/include/luabind/wrapper_base.hpp:31:0,
from vendor/luabind/include/luabind/back_reference.hpp:27,
from vendor/luabind/include/luabind/class.hpp:93,
from vendor/luabind/include/luabind/luabind.hpp:28,
from vendor/luabind/src/class_rep.cpp:29:
vendor/luabind/include/luabind/detail/call_member.hpp:319:1: error: missing binary operator before token "("
In file included from vendor/luabind/include/luabind/back_reference.hpp:27:0,
from vendor/luabind/include/luabind/class.hpp:93,
from vendor/luabind/include/luabind/luabind.hpp:28,
from vendor/luabind/src/class_rep.cpp:29:
vendor/luabind/include/luabind/wrapper_base.hpp:92:1: error: missing binary operator before token "("
In file included from vendor/luabind/include/luabind/wrapper_base.hpp:31:0,
from vendor/luabind/include/luabind/back_reference.hpp:27,
from vendor/luabind/include/luabind/class.hpp:93,
from vendor/luabind/include/luabind/luabind.hpp:28,
from vendor/luabind/src/create_class.cpp:27:
vendor/luabind/include/luabind/detail/call_member.hpp:319:1: error: missing binary operator before token "("
In file included from vendor/luabind/include/luabind/wrapper_base.hpp:31:0,
from vendor/luabind/include/luabind/back_reference.hpp:27,
from vendor/luabind/include/luabind/class.hpp:93,
from vendor/luabind/include/luabind/luabind.hpp:28,
from vendor/luabind/src/class_registry.cpp:27:
vendor/luabind/include/luabind/detail/call_member.hpp:319:1: error: missing binary operator before token "("
In file included from vendor/luabind/include/luabind/wrapper_base.hpp:31:0,
from vendor/luabind/include/luabind/back_reference.hpp:27,
from vendor/luabind/include/luabind/class.hpp:93,
from vendor/luabind/src/class.cpp:30:
vendor/luabind/include/luabind/detail/call_member.hpp:319:1: error: missing binary operator before token "("
In file included from vendor/luabind/include/luabind/wrapper_base.hpp:31:0,
from vendor/luabind/include/luabind/back_reference.hpp:27,
from vendor/luabind/include/luabind/class.hpp:93,
from vendor/luabind/include/luabind/luabind.hpp:28,
from vendor/luabind/src/class_info.cpp:27:
vendor/luabind/include/luabind/detail/call_member.hpp:319:1: error: missing binary operator before token "("
In file included from vendor/luabind/include/luabind/back_reference.hpp:27:0,
from vendor/luabind/include/luabind/class.hpp:93,
from vendor/luabind/include/luabind/luabind.hpp:28,
from vendor/luabind/src/create_class.cpp:27:
vendor/luabind/include/luabind/wrapper_base.hpp:92:1: error: missing binary operator before token "("
In file included from vendor/luabind/include/luabind/back_reference.hpp:27:0,
from vendor/luabind/include/luabind/class.hpp:93,
from vendor/luabind/src/class.cpp:30:
vendor/luabind/include/luabind/wrapper_base.hpp:92:1: error: missing binary operator before token "("
In file included from vendor/luabind/include/luabind/back_reference.hpp:27:0,
from vendor/luabind/include/luabind/class.hpp:93,
from vendor/luabind/include/luabind/luabind.hpp:28,
from vendor/luabind/src/class_registry.cpp:27:
vendor/luabind/include/luabind/wrapper_base.hpp:92:1: error: missing binary operator before token "("
In file included from vendor/luabind/include/luabind/back_reference.hpp:27:0,
from vendor/luabind/include/luabind/class.hpp:93,
from vendor/luabind/include/luabind/luabind.hpp:28,
from vendor/luabind/src/class_info.cpp:27:
vendor/luabind/include/luabind/wrapper_base.hpp:92:1: error: missing binary operator before token "("
In file included from vendor/luabind/include/luabind/function.hpp:10:0,
from vendor/luabind/include/luabind/class.hpp:94,
from vendor/luabind/include/luabind/luabind.hpp:28,
from vendor/luabind/src/class_rep.cpp:29:
vendor/luabind/include/luabind/detail/call_function.hpp:326:1: error: missing binary operator before token "("
In file included from vendor/luabind/include/luabind/detail/constructor.hpp:12:0,
from vendor/luabind/include/luabind/class.hpp:96,
from vendor/luabind/include/luabind/luabind.hpp:28,
from vendor/luabind/src/class_rep.cpp:29:
vendor/luabind/include/luabind/wrapper_base.hpp:92:1: error: missing binary operator before token "("
In file included from vendor/luabind/include/luabind/function.hpp:10:0,
from vendor/luabind/include/luabind/class.hpp:94,
from vendor/luabind/include/luabind/luabind.hpp:28,
from vendor/luabind/src/class_info.cpp:27:
vendor/luabind/include/luabind/detail/call_function.hpp:326:1: error: missing binary operator before token "("
In file included from vendor/luabind/include/luabind/detail/constructor.hpp:12:0,
from vendor/luabind/include/luabind/class.hpp:96,
from vendor/luabind/include/luabind/luabind.hpp:28,
from vendor/luabind/src/class_info.cpp:27:
vendor/luabind/include/luabind/wrapper_base.hpp:92:1: error: missing binary operator before token "("
In file included from vendor/luabind/include/luabind/function.hpp:10:0,
from vendor/luabind/include/luabind/class.hpp:94,
from vendor/luabind/include/luabind/luabind.hpp:28,
from vendor/luabind/src/class_registry.cpp:27:
vendor/luabind/include/luabind/detail/call_function.hpp:326:1: error: missing binary operator before token "("
In file included from vendor/luabind/include/luabind/detail/constructor.hpp:12:0,
from vendor/luabind/include/luabind/class.hpp:96,
from vendor/luabind/include/luabind/luabind.hpp:28,
from vendor/luabind/src/class_registry.cpp:27:
vendor/luabind/include/luabind/wrapper_base.hpp:92:1: error: missing binary operator before token "("
In file included from vendor/luabind/include/luabind/class.hpp:107:0,
from vendor/luabind/include/luabind/luabind.hpp:28,
from vendor/luabind/src/class_rep.cpp:29:
vendor/luabind/include/luabind/detail/call_member.hpp:319:1: error: missing binary operator before token "("
In file included from vendor/luabind/include/luabind/class.hpp:107:0,
from vendor/luabind/include/luabind/luabind.hpp:28,
from vendor/luabind/src/class_registry.cpp:27:
vendor/luabind/include/luabind/detail/call_member.hpp:319:1: error: missing binary operator before token "("
In file included from vendor/luabind/include/luabind/class.hpp:107:0,
from vendor/luabind/include/luabind/luabind.hpp:28,
from vendor/luabind/src/class_info.cpp:27:
vendor/luabind/include/luabind/detail/call_member.hpp:319:1: error: missing binary operator before token "("
In file included from vendor/luabind/include/luabind/function.hpp:10:0,
from vendor/luabind/include/luabind/class.hpp:94,
from vendor/luabind/src/class.cpp:30:
vendor/luabind/include/luabind/detail/call_function.hpp:326:1: error: missing binary operator before token "("
In file included from vendor/luabind/include/luabind/detail/constructor.hpp:12:0,
from vendor/luabind/include/luabind/class.hpp:96,
from vendor/luabind/src/class.cpp:30:
vendor/luabind/include/luabind/wrapper_base.hpp:92:1: error: missing binary operator before token "("
In file included from vendor/luabind/include/luabind/function.hpp:10:0,
from vendor/luabind/include/luabind/class.hpp:94,
from vendor/luabind/include/luabind/luabind.hpp:28,
from vendor/luabind/src/create_class.cpp:27:
vendor/luabind/include/luabind/detail/call_function.hpp:326:1: error: missing binary operator before token "("
In file included from vendor/luabind/include/luabind/detail/constructor.hpp:12:0,
from vendor/luabind/include/luabind/class.hpp:96,
from vendor/luabind/include/luabind/luabind.hpp:28,
from vendor/luabind/src/create_class.cpp:27:
vendor/luabind/include/luabind/wrapper_base.hpp:92:1: error: missing binary operator before token "("
In file included from vendor/luabind/include/luabind/class.hpp:107:0,
from vendor/luabind/src/class.cpp:30:
vendor/luabind/include/luabind/detail/call_member.hpp:319:1: error: missing binary operator before token "("
scons: *** [build/release/build/libraries/luabind/src/class_rep.o] Error 1
In file included from vendor/luabind/include/luabind/class.hpp:107:0,
from vendor/luabind/include/luabind/luabind.hpp:28,
from vendor/luabind/src/create_class.cpp:27:
vendor/luabind/include/luabind/detail/call_member.hpp:319:1: error: missing binary operator before token "("
scons: *** [build/release/build/libraries/luabind/src/class_registry.o] Error 1
scons: *** [build/release/build/libraries/luabind/src/class_info.o] Error 1
scons: *** [build/release/build/libraries/luabind/src/class.o] Error 1
scons: *** [build/release/build/libraries/luabind/src/create_class.o] Error 1
scons: building terminated because of errors.
==> ERROR: A failure occurred in build().
Aborting...
======Messages End======

My dependency information:
boost-libs 1.50.0-3
glew 1.9.0-2
libmad 0.15.1b-6
sdl_image 1.2.12-2
sdl_mixer 1.2.12-3
sdl_ttf 2.0.11-2

sn4kebite commented on 2011-05-16 21:33

rlvm 0.12 released, now has an application menu link.

sn4kebite commented on 2011-03-11 16:37

Because Arch now builds thread-aware boost libraries only, and the rlvm SConstruct doesn't handle this (yet), I upped the boost-libs version to 1.46 to avoid any problems. If you want to build with boost-libs 1.45 or lower, you need to make sure the SConstruct links with the -mt versions of the boost libs (at least for the default Arch packages).

tl;dr: If your boost{,-libs} is at version 1.46, you don't have anything to worry about.

All comments