Package Details: robomongo 1.0.0-3

Git Clone URL: (read-only)
Package Base: robomongo
Description: Shell-centric cross-platform open source MongoDB management tool
Upstream URL:
Keywords: gui mongodb tool
Licenses: GPLv3
Conflicts: robomongo-bin
Submitter: k.duborenko
Maintainer: vyachkonovalov
Last Packager: vyachkonovalov
Votes: 79
Popularity: 0.032046
First Submitted: 2013-03-27 08:47
Last Updated: 2017-05-01 13:22

Latest Comments

RidingLuck commented on 2017-07-12 14:08

This package is out of date.

Use this:

thanks to @lgatica it was so useful

darkbasic commented on 2017-06-22 09:10

This is binary, I would prefer to compile from source.

miblon commented on 2017-06-22 09:03

I installed the out of date package to discover the product has been renamed. Please go to

lgatica commented on 2017-06-19 15:07

Already new version

darkbasic commented on 2017-06-17 13:06

[ 68%] Building CXX object src/robomongo/CMakeFiles/robomongo.dir/core/settings/SettingsManager.cpp.o
/home/niko/.cache/pacaur/robomongo/src/robomongo-1124ec22c6e35055da67579410d7f3630a1954be/src/robomongo/core/settings/SettingsManager.cpp:21:10: fatal error: 5.8.0/QtGui/private/qzipreader_p.h: File o directory non esistente
#include <5.8.0/QtGui/private/qzipreader_p.h>
compilation terminated.
make[2]: *** [src/robomongo/CMakeFiles/robomongo.dir/build.make:1023: src/robomongo/CMakeFiles/robomongo.dir/core/settings/SettingsManager.cpp.o] Error 1
make[2]: *** Attesa per i processi non terminati....
make[1]: *** [CMakeFiles/Makefile2:495: src/robomongo/CMakeFiles/robomongo.dir/all] Error 2
make: *** [Makefile:152: all] Error 2

Nowaker commented on 2017-06-16 18:20

Should the package be renamed to robo3t now that the application has been released under the new name? If so, I propose to modify the package description to: "Shell-centric cross-platform open source MongoDB management tool (formerly Robomongo)" to make it easier for people looking for Robomongo to find Robo 3T.

User0 commented on 2017-06-16 08:51

Error building src/robomongo/CMakeFiles/robomongo.dir/core/settings/SettingsManager.cpp.o

because my Qt5 Gui version is 5.9.0

SettingsManager.cpp.patch needs an update

vyachkonovalov commented on 2017-05-02 10:27

You're welcome :)

Musikolo commented on 2017-05-02 02:00

I think it's working now.

Thank you Vyachkonovalov!

vyachkonovalov commented on 2017-05-01 13:20

o0ps, my editor removed trailing whitespaces in patch files which cause an patch error :(
pkgrel=3 is coming

All comments