Package Details: ros-indigo-resource-retriever 1.11.6-1

Git Clone URL: https://aur.archlinux.org/ros-indigo-resource-retriever.git (read-only)
Package Base: ros-indigo-resource-retriever
Description: ROS - This package retrieves data from url-format files such as http://, ftp://, package:// file://, etc., and loads the data into memory.
Upstream URL: http://ros.org/wiki/resource_retriever
Licenses: BSD
Submitter: bchretien
Maintainer: None
Last Packager: bchretien
Votes: 1
Popularity: 0.000000
First Submitted: 2014-06-07 15:56
Last Updated: 2015-06-17 16:51

Latest Comments

tlou commented on 2016-08-18 06:04

@bchretien : should i report/ask in Issues in GitHub or PullRequest or? sorry, not familiar to this operation :p

bchretien commented on 2016-08-07 11:11

@tlou : Have you reported this issue upstream? If you provide them with a patch, I can then apply it here.

tlou commented on 2016-08-06 08:48

with curl-7.50: the conflict of "typedef void CURL" could be fixed by commenting this line and adding "#include <curl/curl.h>" before it. before ros team handles this problem, we may need to install this package locally

Jinxit commented on 2016-08-05 13:42

I get the following error during build:

[ 50%] Building CXX object CMakeFiles/resource_retriever.dir/src/retriever.cpp.o
In file included from /tmp/packerbuild-1000/ros-indigo-resource-retriever/ros-indigo-resource-retriever/src/resource_retriever/src/retriever.cpp:35:0:
/usr/include/curl/curl.h:94:26: error: conflicting declaration ‘typedef struct Curl_easy CURL’
typedef struct Curl_easy CURL;
^~~~
In file included from /tmp/packerbuild-1000/ros-indigo-resource-retriever/ros-in# Script generated with import_catkin_packages.py
digo-resource-retriever/src/resource_retriever/src/retriever.cpp:28:0:
/tmp/packerbuild-1000/ros-indigo-resource-retriever/ros-indigo-resource-retriever/src/resource_retriever/include/resource_retriever/retriever.h:36:14: note: previous declaration as ‘typedef void CURL’
typedef void CURL;
^~~~
make[2]: *** [CMakeFiles/resource_retriever.dir/build.make:63: CMakeFiles/resource_retriever.dir/src/retriever.cpp.o] Error 1
make[1]: *** [CMakeFiles/Makefile2:228: CMakeFiles/resource_retriever.dir/all] Error 2
make: *** [Makefile:128: all] Error 2
==> ERROR: A failure occurred in build().
Aborting...