Package Details: ros-kinetic-desktop 1.3.2-1

Git Clone URL: https://aur.archlinux.org/ros-kinetic-desktop.git (read-only)
Package Base: ros-kinetic-desktop
Description: ROS - A metapackage to aggregate several packages.
Upstream URL: http://www.ros.org/
Licenses: BSD
Submitter: racko
Maintainer: None
Last Packager: GPereira
Votes: 0
Popularity: 0.000000
First Submitted: 2017-03-04 18:58
Last Updated: 2018-05-08 15:01

Latest Comments

racko commented on 2017-12-17 06:50

Thank you for reporting this issue. I'll be able to look into it in a few hours.

mr_paja commented on 2017-12-16 17:35

Hi, when I try to install the package it fails while building ros-kinetic-viz. So I tried to install the latter package first and I get the following error:

-- catkin 0.7.8 -- Boost version: 1.65.1 -- Found the following Boost libraries: -- filesystem -- system -- Found PythonLibs: /usr/lib/libpython2.7.so (found suitable version "2.7.14", minimum required is "2.7") CMake Warning at /opt/ros/kinetic/share/python_qt_binding/cmake/shiboken_helper.cmake:18 (find_package): By not providing "FindShiboken2.cmake" in CMAKE_MODULE_PATH this project has asked CMake to find a package configuration file provided by "Shiboken2", but CMake did not find one.

Could not find a package configuration file provided by "Shiboken2" with any of the following names:

Shiboken2Config.cmake
shiboken2-config.cmake

Add the installation prefix of "Shiboken2" to CMAKE_PREFIX_PATH or set "Shiboken2_DIR" to a directory containing one of the above files. If "Shiboken2" provides a separate development package or SDK, be sure it has been installed. Call Stack (most recent call first): src/qt_gui_cpp_shiboken/CMakeLists.txt:41 (include)

CMake Warning at /opt/ros/kinetic/share/python_qt_binding/cmake/shiboken_helper.cmake:23 (find_package): By not providing "FindPySide2.cmake" in CMAKE_MODULE_PATH this project has asked CMake to find a package configuration file provided by "PySide2", but CMake did not find one.

Could not find a package configuration file provided by "PySide2" with any of the following names:

PySide2Config.cmake
pyside2-config.cmake

Add the installation prefix of "PySide2" to CMAKE_PREFIX_PATH or set "PySide2_DIR" to a directory containing one of the above files. If "PySide2" provides a separate development package or SDK, be sure it has been installed. Call Stack (most recent call first): src/qt_gui_cpp_shiboken/CMakeLists.txt:41 (include)

CMake Warning at /opt/ros/kinetic/share/python_qt_binding/cmake/shiboken_helper.cmake:34 (message): Shiboken binding generator NOT available. Call Stack (most recent call first): src/qt_gui_cpp_shiboken/CMakeLists.txt:41 (include)

-- Found PythonInterp: /usr/bin/python2 (found suitable version "2.7.14", minimum required is "2.7") -- SIP binding generator available. -- Python binding generators: sip -- Configuring done -- Generating done -- Build files have been written to: /home/paja/.cache/pacaur/ros-kinetic-qt-gui-cpp/src/build [ 16%] Generating //include/qt_gui_cpp/moc_plugin.cpp [ 16%] Generating //include/qt_gui_cpp/moc_plugin_context.cpp [ 16%] Generating //include/qt_gui_cpp/moc_plugin_bridge.cpp Scanning dependencies of target qt_gui_cpp [ 22%] Building CXX object src/qt_gui_cpp/CMakeFiles/qt_gui_cpp.dir/plugin_provider.cpp.o [ 27%] Building CXX object src/qt_gui_cpp/CMakeFiles/qt_gui_cpp.dir/composite_plugin_provider.cpp.o [ 33%] Building CXX object src/qt_gui_cpp/CMakeFiles/qt_gui_cpp.dir/plugin_bridge.cpp.o [ 38%] Building CXX object src/qt_gui_cpp/CMakeFiles/qt_gui_cpp.dir/generic_proxy.cpp.o [ 44%] Building CXX object src/qt_gui_cpp/CMakeFiles/qt_gui_cpp.dir/plugin_context.cpp.o [ 50%] Building CXX object src/qt_gui_cpp/CMakeFiles/qt_gui_cpp.dir/plugin_descriptor.cpp.o [ 55%] Building CXX object src/qt_gui_cpp/CMakeFiles/qt_gui_cpp.dir/recursive_plugin_provider.cpp.o [ 61%] Building CXX object src/qt_gui_cpp/CMakeFiles/qt_gui_cpp.dir/settings.cpp.o [ 66%] Building CXX object src/qt_gui_cpp/CMakeFiles/qt_gui_cpp.dir///include/qt_gui_cpp/moc_plugin.cpp.o [ 72%] Building CXX object src/qt_gui_cpp/CMakeFiles/qt_gui_cpp.dir///include/qt_gui_cpp/moc_plugin_bridge.cpp.o [ 77%] Building CXX object src/qt_gui_cpp/CMakeFiles/qt_gui_cpp.dir///include/qt_gui_cpp/moc_plugin_context.cpp.o In file included from /home/paja/.cache/pacaur/ros-kinetic-qt-gui-cpp/src/qt_gui_core-release-release-kinetic-qt_gui_cpp-0.3.3-0/include/qt_gui_cpp/ros_pluginlib_plugin_provider_for_plugin_providers.h:37:0, from /home/paja/.cache/pacaur/ros-kinetic-qt-gui-cpp/src/qt_gui_core-release-release-kinetic-qt_gui_cpp-0.3.3-0/include/qt_gui_cpp/recursive_plugin_provider.h:37, from /home/paja/.cache/pacaur/ros-kinetic-qt-gui-cpp/src/qt_gui_core-release-release-kinetic-qt_gui_cpp-0.3.3-0/src/qt_gui_cpp/recursive_plugin_provider.cpp:33: /home/paja/.cache/pacaur/ros-kinetic-qt-gui-cpp/src/qt_gui_core-release-release-kinetic-qt_gui_cpp-0.3.3-0/include/qt_gui_cpp/ros_pluginlib_plugin_provider.h:357:30: error: ‘TiXmlElement’ has not been declared void parseActionAttributes(TiXmlElement element, const std::string& plugin_path, QString& label, QString& statustip, QString& icon, QString& icontype) ^~~~~~~~~~~~ /home/paja/.cache/pacaur/ros-kinetic-qt-gui-cpp/src/qt_gui_core-release-release-kinetic-qt_gui_cpp-0.3.3-0/include/qt_gui_cpp/ros_pluginlib_plugin_provider.h: In member function ‘bool qt_gui_cpp::RosPluginlibPluginProvider<t>::parseManifest(const string&, const string&, QString&, QString&, QString&, QString&, qt_gui_cpp::PluginDescriptor</t>)’: /home/paja/.cache/pacaur/ros-kinetic-qt-gui-cpp/src/qt_gui_core-release-release-kinetic-qt_gui_cpp-0.3.3-0/include/qt_gui_cpp/ros_pluginlib_plugin_provider.h:298:5: error: ‘TiXmlDocument’ was not declared in this scope TiXmlDocument doc; ^~~~~~~~~~~~~ /home/paja/.cache/pacaur/ros-kinetic-qt-gui-cpp/src/qt_gui_core-release-release-kinetic-qt_gui_cpp-0.3.3-0/include/qt_gui_cpp/ros_pluginlib_plugin_provider.h:298:5: note: suggested alternative: ‘QJsonDocument’ TiXmlDocument doc; ^~~~~~~~~~~~~ QJsonDocument /home/paja/.cache/pacaur/ros-kinetic-qt-gui-cpp/src/qt_gui_core-release-release-kinetic-qt_gui_cpp-0.3.3-0/include/qt_gui_cpp/ros_pluginlib_plugin_provider.h:299:19: error: ‘doc’ was not declared in this scope bool loaded = doc.LoadFile(manifest_path); ^~~ /home/paja/.cache/pacaur/ros-kinetic-qt-gui-cpp/src/qt_gui_core-release-release-kinetic-qt_gui_cpp-0.3.3-0/include/qt_gui_cpp/ros_pluginlib_plugin_provider.h:315:5: error: ‘TiXmlElement’ was not declared in this scope TiXmlElement library_element = doc.FirstChildElement("library"); ^~~~~~~~~~~~ /home/paja/.cache/pacaur/ros-kinetic-qt-gui-cpp/src/qt_gui_core-release-release-kinetic-qt_gui_cpp-0.3.3-0/include/qt_gui_cpp/ros_pluginlib_plugin_provider.h:315:19: error: ‘library_element’ was not declared in this scope TiXmlElement library_element = doc.FirstChildElement("library"); ^~~~~~~~~~~~~~~ /home/paja/.cache/pacaur/ros-kinetic-qt-gui-cpp/src/qt_gui_core-release-release-kinetic-qt_gui_cpp-0.3.3-0/include/qt_gui_cpp/ros_pluginlib_plugin_provider.h:319:23: error: ‘class_element’ was not declared in this scope TiXmlElement class_element = library_element->FirstChildElement("class"); ^~~~~~~~~~~~~ /home/paja/.cache/pacaur/ros-kinetic-qt-gui-cpp/src/qt_gui_core-release-release-kinetic-qt_gui_cpp-0.3.3-0/include/qt_gui_cpp/ros_pluginlib_plugin_provider.h:319:23: note: suggested alternative: ‘class_loader_’ TiXmlElement class_element = library_element->FirstChildElement("class"); ^~~~~~~~~~~~~ class_loader_ /home/paja/.cache/pacaur/ros-kinetic-qt-gui-cpp/src/qt_gui_core-release-release-kinetic-qt_gui_cpp-0.3.3-0/include/qt_gui_cpp/ros_pluginlib_plugin_provider.h:324:27: error: ‘qtgui_element’ was not declared in this scope TiXmlElement qtgui_element = class_element->FirstChildElement("qtgui"); ^~~~~~~~~~~~~ /home/paja/.cache/pacaur/ros-kinetic-qt-gui-cpp/src/qt_gui_core-release-release-kinetic-qt_gui_cpp-0.3.3-0/include/qt_gui_cpp/ros_pluginlib_plugin_provider.h:331:29: error: ‘group_element’ was not declared in this scope TiXmlElement group_element = qtgui_element->FirstChildElement("group"); ^~~~~~~~~~~~~ /home/paja/.cache/pacaur/ros-kinetic-qt-gui-cpp/src/qt_gui_core-release-release-kinetic-qt_gui_cpp-0.3.3-0/include/qt_gui_cpp/ros_pluginlib_plugin_provider.h:331:29: note: suggested alternative: ‘group_member’ TiXmlElement group_element = qtgui_element->FirstChildElement("group"); ^~~~~~~~~~~~~ group_member /home/paja/.cache/pacaur/ros-kinetic-qt-gui-cpp/src/qt_gui_core-release-release-kinetic-qt_gui_cpp-0.3.3-0/include/qt_gui_cpp/ros_pluginlib_plugin_provider.h: In member function ‘void qt_gui_cpp::RosPluginlibPluginProvider<t>::parseActionAttributes(int</t>, const string&, QString&, QString&, QString&, QString&)’: /home/paja/.cache/pacaur/ros-kinetic-qt-gui-cpp/src/qt_gui_core-release-release-kinetic-qt_gui_cpp-0.3.3-0/include/qt_gui_cpp/ros_pluginlib_plugin_provider.h:359:5: error: ‘TiXmlElement’ was not declared in this scope TiXmlElement child_element; ^~~~~~~~~~~~ /home/paja/.cache/pacaur/ros-kinetic-qt-gui-cpp/src/qt_gui_core-release-release-kinetic-qt_gui_cpp-0.3.3-0/include/qt_gui_cpp/ros_pluginlib_plugin_provider.h:359:5: note: suggested alternative: ‘element’ TiXmlElement child_element; ^~~~~~~~~~~~ element /home/paja/.cache/pacaur/ros-kinetic-qt-gui-cpp/src/qt_gui_core-release-release-kinetic-qt_gui_cpp-0.3.3-0/include/qt_gui_cpp/ros_pluginlib_plugin_provider.h:359:19: error: ‘child_element’ was not declared in this scope TiXmlElement child_element; ^~~~~~~~~~~~~ /home/paja/.cache/pacaur/ros-kinetic-qt-gui-cpp/src/qt_gui_core-release-release-kinetic-qt_gui_cpp-0.3.3-0/include/qt_gui_cpp/ros_pluginlib_plugin_provider.h:359:19: note: suggested alternative: ‘childEvent’ TiXmlElement child_element; ^~~~~~~~~~~~~ childEvent /home/paja/.cache/pacaur/ros-kinetic-qt-gui-cpp/src/qt_gui_core-release-release-kinetic-qt_gui_cpp-0.3.3-0/include/qt_gui_cpp/ros_pluginlib_plugin_provider.h:360:35: error: request for member ‘FirstChildElement’ in ‘element->’, which is of non-class type ‘int’ if ((child_element = element->FirstChildElement("label")) != 0) ^~~~~~~~~~~~~~~~~ /home/paja/.cache/pacaur/ros-kinetic-qt-gui-cpp/src/qt_gui_core-release-release-kinetic-qt_gui_cpp-0.3.3-0/include/qt_gui_cpp/ros_pluginlib_plugin_provider.h:364:35: error: request for member ‘FirstChildElement’ in ‘element->’, which is of non-class type ‘int’ if ((child_element = element->FirstChildElement("icon")) != 0) ^~~~~~~~~~~~~~~~~ /home/paja/.cache/pacaur/ros-kinetic-qt-gui-cpp/src/qt_gui_core-release-release-kinetic-qt_gui_cpp-0.3.3-0/include/qt_gui_cpp/ros_pluginlib_plugin_provider.h:379:35: error: request for member ‘FirstChildElement’ in ‘element->’, which is of non-class type ‘int’ if ((child_element = element->FirstChildElement("statustip")) != 0) ^~~~~~~~~~~~~~~~~ make[2]: [src/qt_gui_cpp/CMakeFiles/qt_gui_cpp.dir/build.make:219: src/qt_gui_cpp/CMakeFiles/qt_gui_cpp.dir/recursive_plugin_provider.cpp.o] Error 1 make[1]: [CMakeFiles/Makefile2:302: src/qt_gui_cpp/CMakeFiles/qt_gui_cpp.dir/all] Error 2 make: *** [Makefile:130: all] Error 2 ==> ERROR: A failure occurred in build(). Aborting...