Package Details: ros-noetic-std-msgs 0.5.13-1

Git Clone URL: (read-only, click to copy)
Package Base: ros-noetic-std-msgs
Description: ROS - Standard ROS Messages including common message types representing primitive data types and other basic message constructs, such as multiarrays.
Upstream URL:
Licenses: BSD
Submitter: acxz
Maintainer: acxz
Last Packager: acxz
Votes: 0
Popularity: 0.000000
First Submitted: 2020-05-24 13:18 (UTC)
Last Updated: 2020-05-24 17:07 (UTC)

Required by (213)

Sources (1)

Latest Comments

acxz commented on 2021-10-13 17:55 (UTC)

Development is on Github: Please open issues and PRs there instead of commenting.

fclad commented on 2021-09-27 15:22 (UTC)

Hey, this is failing. The error message is copied below:

Traceback (most recent call last):
  File "/usr/lib/python3.9/site-packages/catkin_pkg/", line 596, in parse_package_string
    root = dom.parseString(data)
  File "/usr/lib/python3.9/xml/dom/", line 1998, in parseString
    return expatbuilder.parseString(string)
  File "/usr/lib/python3.9/xml/dom/", line 925, in parseString
    return builder.parseString(string)
  File "/usr/lib/python3.9/xml/dom/", line 223, in parseString
    parser.Parse(string, True)
xml.parsers.expat.ExpatError: no element found: line 1, column 0

During handling of the above exception, another exception occurred:

Traceback (most recent call last):
  File "/opt/ros/noetic/lib/python3.9/site-packages/geneus/", line 136, in genmain
    pkg_map = get_pkg_map()
  File "/opt/ros/noetic/lib/python3.9/site-packages/geneus/", line 56, in get_pkg_map
    pkgs = packages.find_packages(ws)
  File "/usr/lib/python3.9/site-packages/catkin_pkg/", line 87, in find_packages
    packages = find_packages_allowing_duplicates(basepath, exclude_paths=exclude_paths, exclude_subspaces=exclude_subspaces, warnings=warnings)
  File "/usr/lib/python3.9/site-packages/catkin_pkg/", line 147, in find_packages_allowing_duplicates
    parsed_package = parse_package_string(
  File "/usr/lib/python3.9/site-packages/catkin_pkg/", line 598, in parse_package_string
    raise InvalidPackage('The manifest contains invalid XML:\n%s' % ex, filename)
catkin_pkg.package.InvalidPackage: Error(s) in package '/opt/ros/noetic/share/rqt_shell/package.xml':
The manifest contains invalid XML:
no element found: line 1, column 0
ERROR:  Error(s) in package '/opt/ros/noetic/share/rqt_shell/package.xml':
The manifest contains invalid XML:
no element found: line 1, column 0
make[2]: *** [CMakeFiles/std_msgs_generate_messages_eus.dir/build.make:105: devel/share/roseus/ros/std_msgs/manifest.l] Error 3
make[1]: *** [CMakeFiles/Makefile2:607: CMakeFiles/std_msgs_generate_messages_eus.dir/all] Error 2