Package Details: rr62x 1.2-2

Git Clone URL: https://aur.archlinux.org/rr62x.git (read-only)
Package Base: rr62x
Description: Kernel modules for Highpoint RocketRAID 62x SATA/6Gbps Card.
Upstream URL: http://www.highpoint-tech.com/USA_new/series_rr600-download.htm
Licenses: custom
Submitter: PreparationH67
Maintainer: PreparationH67
Last Packager: PreparationH67
Votes: 0
Popularity: 0.000000
First Submitted: 2015-09-04 13:41
Last Updated: 2015-09-14 21:36

Latest Comments

ZaeArch commented on 2016-09-09 00:52

This doesn't work for me:
/tmp/aur/rr62x/src/rr62x-linux-src-v1.2/product/rr62x/linux/.build/os_linux.c:364:35: error: âstruct inodeâ has no member named âi_mutexâ; did you mean âi_modeâ?
mutex_lock(&bdev->bd_inode->i_mutex);
^~
/tmp/aur/rr62x/src/rr62x-linux-src-v1.2/product/rr62x/linux/.build/os_linux.c:370:37: error: âstruct inodeâ has no member named âi_mutexâ; did you mean âi_modeâ?
mutex_unlock(&bdev->bd_inode->i_mutex);
^~
make[2]: *** [scripts/Makefile.build:290: /tmp/aur/rr62x/src/rr62x-linux-src-v1.2/product/rr62x/linux/.build/os_linux.o] Error 1
make[1]: *** [Makefile:1457: _module_/tmp/aur/rr62x/src/rr62x-linux-src-v1.2/product/rr62x/linux/.build] Error 2
make[1]: Leaving directory '/usr/lib/modules/4.7.2-1-ARCH/build'
make: *** [../../../inc/linux/Makefile.def:106: rr62x.ko] Error 2
==> ERROR: A failure occurred in build().
Aborting...

Linux 4.7.2-1-ARCH #1