Package Details: rstudio-desktop 1.2.1335-1

Git Clone URL: https://aur.archlinux.org/rstudio-desktop.git (read-only)
Package Base: rstudio-desktop
Description: Open source and enterprise-ready professional software for the R community
Upstream URL: http://www.rstudio.com/
Licenses: AGPL
Conflicts: rstudio-desktop-bin, rstudio-desktop-git, rstudio-desktop-preview-bin
Submitter: None
Maintainer: flying-sheep
Last Packager: flying-sheep
Votes: 43
Popularity: 0.043879
First Submitted: 2011-03-04 15:02
Last Updated: 2019-04-10 11:05

Required by (0)

Sources (4)

Pinned Comments

Xentec commented on 2019-07-08 01:13

Got same error...

make: *** [Makefile:152: all] Error 2

With a bit of backtracking...

BUILD FAILED /tmp/makepkg/rstudio-desktop/src/rstudio-rstudio-f1ac345/src/gwt/build.xml:98: Error running javac compiler

So my javac binary decided to disappear even with jdk-openjdk installed, huh? Turns out I still had wrong Java version set as default and after executing

# archlinux-java set java-8-openjdk

ant was finally willing to build gwt and the Rstudio installation was complete.

Latest Comments

« First ‹ Previous ... 2 3 4 5 6 7 8 9 10 Next › Last »

flying-sheep commented on 2015-07-09 07:38

hi, this is up and kicking again!

the only thing i’ve “cheated” with is that i call install_packages to install rsconnect from git.

if that would be changed to manually install a version of the package (they don’t git-tag versions, but regularly bump it in the description file), this package could be built from the sources without internet access.

kidoz commented on 2014-05-05 17:54

It may be useful to someone - pkgbuild for version 0.9.8.507
https://github.com/kidoz/pkgbuilds/tree/master/rstudio-desktop

Dasonk commented on 2014-04-24 22:31

I emailed the maintainer a few days ago and haven't heard back yet. If it goes another week I'll be requesting that this gets orphaned.

sokuban commented on 2014-02-28 20:52

I have the same problem as gbc921, same error messages and all. Did you/anyone find a fix in the end? I tried using jdk6, but that didn't seem to help.

gbc921 commented on 2013-04-05 01:24

Seems a permission problem (arch x64, jdk)?

Linking CXX executable rstudio
[ 79%] Built target rstudio
[java] Compile of permutations succeeded
[java] Linking into /tmp/yaourt-tmp-gabriel/aur-rstudio-desktop/src/rstudio-rstudio-d528686/src/gwt/www/rstudio; Writing extras to /tmp/yaourt-tmp-gabriel/aur-rstudio-desktop/src/rstudio-rstudio-d528686/src/gwt/extras/rstudio
[java] Link succeeded
[java] Compilation succeeded -- 162.691s
[java] Exception in thread "Thread-2" java.lang.SecurityException: Could not lock User prefs. Lock file access denied.
[java] at java.util.prefs.FileSystemPreferences.checkLockFile0ErrorCode(FileSystemPreferences.java:936)
[java] at java.util.prefs.FileSystemPreferences.lockFile(FileSystemPreferences.java:925)
[java] at java.util.prefs.FileSystemPreferences.sync(FileSystemPreferences.java:729)
[java] at java.util.prefs.FileSystemPreferences.flush(FileSystemPreferences.java:824)
[java] at java.util.prefs.FileSystemPreferences.syncWorld(FileSystemPreferences.java:464)
[java] at java.util.prefs.FileSystemPreferences.access$1200(FileSystemPreferences.java:50)
[java] at java.util.prefs.FileSystemPreferences$4$1.run(FileSystemPreferences.java:442)

BUILD SUCCESSFUL
Total time: 3 minutes 48 seconds
[ 79%] Built target gwt_build
make: *** [all] Error 2

ender4 commented on 2013-02-10 07:35

Is there any way to get this working with JDK 7 installed, since openjdk6 conflicts with openjdk7?

tdy commented on 2013-01-28 23:27

The build works fine on all of my comps, but it does fail in a clean chroot. It seems that jdk6 is needed for the build, so I added a "<7" filter and now it builds fine for me in the chroot also.

Anonymous comment on 2013-01-28 22:36

BUILD FAILED
I am getting following error:

/home/yasar/rstudio/src/rstudio-rstudio-2f428e3/src/gwt/build.xml:144: The following error occurred while executing this line:
/home/yasar/rstudio/src/rstudio-rstudio-2f428e3/src/gwt/build.xml:105: Java returned: 1

Total time: 3 minutes 23 seconds
make[2]: *** [gwt_build] Hata 1
make[1]: *** [src/gwt/CMakeFiles/gwt_build.dir/all] Hata 2
make: *** [all] Hata 2

tdy commented on 2013-01-04 05:08

fyi the build is now fixed

artemklevtsov commented on 2012-06-23 01:21

@mrbit: try rstudio-desktop-git.