Package Details: rtv-git r1473.ae9f407-1

Git Clone URL: https://aur.archlinux.org/rtv-git.git (read-only, click to copy)
Package Base: rtv-git
Description: Browse Reddit from your terminal
Upstream URL: https://github.com/michael-lazar/rtv
Licenses: MIT
Conflicts: rtv
Submitter: None
Maintainer: None
Last Packager: tuckerboniface
Votes: 11
Popularity: 0.000000
First Submitted: 2015-04-02 03:20
Last Updated: 2018-08-13 22:43

Latest Comments

« First ‹ Previous 1 2

Duncanla commented on 2016-08-15 04:04

I'm getting a build failure.

Looks like the source directory in the build() function is incorrect. It should be $srcdir/rtv instead of $srcdir/$pkgname-$pkgver.

Anonymous comment on 2015-10-09 22:19

@j3zz4h Not sure where to begin with this. I can't replicate this. But it might be an issue of what locale you have set seeing the unicode error. The packages are more or less helpers to install rtv. You might want to open an issue at the github page. https://github.com/michael-lazar/rtv/issues And even try to install it from the other means listed there. You can also check this out, https://github.com/crsmithdev/arrow/issues/208 it's a similar error you seem to have, and basicly you need to setup your locale to en_US.utf8 (or whatever locale makes sense for you ofc) more info for that here: https://wiki.archlinux.org/index.php/Locale

j3zz4h commented on 2015-10-09 22:08

Having an issue builing both rtv and rtv-git

____________________________________________________________________________
==> Starting package()...
Traceback (most recent call last):
File "setup.py", line 16, in <module>
long_description=open('README.rst').read(),
File "/usr/lib/python3.5/encodings/ascii.py", line 26, in decode
return codecs.ascii_decode(input, self.errors)[0]
UnicodeDecodeError: 'ascii' codec can't decode byte 0xe2 in position 1256: ordinal not in range(128)
==> ERROR: A failure occurred in package().
Aborting...
____________________________________________________________________________

*** Setting the locale at "/etc/locale.conf" fixed this issue...
see - https://github.com/crsmithdev/arrow/issues/208

@shaggytwodope -- TY very much!

Anonymous comment on 2015-10-08 14:10

@Ranzpirat added. Sorry I didn't notice a new dependacy.

Anonymous comment on 2015-10-08 12:41

This needs python-tornado added to dependencies.

Ville.Kovacs commented on 2015-04-30 13:38

same thing

Anonymous comment on 2015-04-27 21:30

@Ville.Kovacs Not sure of the issue, but --unicode is experimental as far as I know. What happens when you simply run it with no arguments?

Ville.Kovacs commented on 2015-04-27 14:30

% rtv --unicode -u user
Connecting...
Password for user:
Traceback (most recent call last):
File "/usr/bin/rtv", line 9, in <module>
load_entry_point('rtv==1.3', 'console_scripts', 'rtv')()
File "/usr/lib/python3.4/site-packages/pkg_resources/__init__.py", line 546, in load_entry_point
return get_distribution(dist).load_entry_point(group, name)
File "/usr/lib/python3.4/site-packages/pkg_resources/__init__.py", line 2666, in load_entry_point
return ep.load()
File "/usr/lib/python3.4/site-packages/pkg_resources/__init__.py", line 2339, in load
return self.resolve()
File "/usr/lib/python3.4/site-packages/pkg_resources/__init__.py", line 2345, in resolve
module = __import__(self.module_name, fromlist=['__name__'], level=0)
File "/usr/lib/python3.4/site-packages/rtv/__main__.py", line 135, in <module>
sys.exit(main())
File "/usr/lib/python3.4/site-packages/rtv/__main__.py", line 111, in main
reddit.login(args.username, args.password)
File "/usr/lib/python3.4/site-packages/praw/__init__.py", line 1334, in login
self.user = self.get_redditor(user)
File "/usr/lib/python3.4/site-packages/praw/__init__.py", line 949, in get_redditor
return objects.Redditor(self, user_name, *args, **kwargs)
File "/usr/lib/python3.4/site-packages/praw/objects.py", line 746, in __init__
fetch, info_url)
File "/usr/lib/python3.4/site-packages/praw/objects.py", line 73, in __init__
self.has_fetched = self._populate(json_dict, fetch)
File "/usr/lib/python3.4/site-packages/praw/objects.py", line 133, in _populate
json_dict = self._get_json_dict() if fetch else {}
File "/usr/lib/python3.4/site-packages/praw/objects.py", line 126, in _get_json_dict
as_objects=False)
File "/usr/lib/python3.4/site-packages/praw/decorators.py", line 163, in wrapped
return_value = function(reddit_session, *args, **kwargs)
File "/usr/lib/python3.4/site-packages/praw/__init__.py", line 561, in request_json
retry_on_error=retry_on_error)
File "/usr/lib/python3.4/site-packages/praw/__init__.py", line 402, in _request
response = handle_redirect()
File "/usr/lib/python3.4/site-packages/praw/__init__.py", line 376, in handle_redirect
url = _raise_redirect_exceptions(response)
File "/usr/lib/python3.4/site-packages/praw/internal.py", line 164, in _raise_redirect_exceptions
raise RedirectException(response.url, new_url)
praw.errors.RedirectException: Unexpected redirect from http://www.reddit.com/user/user/about/.json to https://www.reddit.com/user/user/about/.json