Package Details: ruby-xapian-ruby 1.2.21-1

Git Clone URL: (read-only)
Package Base: ruby-xapian-ruby
Description: xapian libraries and ruby bindings
Upstream URL:
Submitter: asch
Maintainer: asch
Last Packager: asch
Votes: 8
Popularity: 0.624275
First Submitted: 2013-10-14 14:38
Last Updated: 2015-07-17 17:14

Latest Comments

derhamster commented on 2015-08-11 13:12

I am on x84_64. But I think the problem is parallel builds, due to my MAKEFLAGS. When I build it without any -j flags in MAKEFLAGS, the problem mentioned below by kiwisauce is gone and the package builds successfully.

asch commented on 2015-08-03 17:33

What architecture?

derhamster commented on 2015-08-03 17:05

I get the same error as kiwisauce. In a clean installation of Arch with only base-devel and ruby.

asch commented on 2015-07-17 21:10

Not my issue. Works with clean installation of arch.

kiwisauce commented on 2015-07-17 16:05

Does not compile:
libtool: link: ar cru .libs/libchertcheck.a backends/chert/.libs/chert_check.o
libtool: link: ranlib .libs/libchertcheck.a
libtool: error: 'common/getopt.lo' is not a valid libtool object
Makefile:1651: recipe for target '' failed
make[2]: *** [] Error 1
make[2]: *** Waiting for unfinished jobs....
libtool: link: ar cru .libs/libflintcheck.a backends/flint/.libs/flint_check.o
libtool: link: ranlib .libs/libflintcheck.a
libtool: link: ( cd ".libs" && rm -f "" && ln -s "../" "" )
libtool: link: ( cd ".libs" && rm -f "" && ln -s "../" "" )
libtool: compile: g++ -DHAVE_CONFIG_H -I. -I./common -I./include -D_FORTIFY_SOURCE=2 -fshow-column -Wall -W -Wredundant-decls -Wpointer-arith -Wcast-qual -Wcast-align -Wno-long-long -Wformat-security -fno-gnu-keywords -Wundef -Woverloaded-virtual -Wstrict-null-sentinel -Wshadow -Wstrict-overflow=1 -Wlogical-op -Wmissing-declarations -Wdouble-promotion -Winit-self -fvisibility=hidden -march=x86-64 -mtune=generic -O2 -pipe -fstack-protector-strong --param=ssp-buffer-size=4 -MT queryparser/queryparser_internal.lo -MD -MP -MF queryparser/.deps/queryparser_internal.Tpo -c queryparser/ -o queryparser/queryparser_internal.o >/dev/null 2>&1
mv -f bin/.deps/bin_xapian_check-xapian-check.Tpo bin/.deps/bin_xapian_check-xapian-check.Po
make[2]: Leaving directory '/tmp/ruby-xapian-ruby/pkg/ruby-xapian-ruby/usr/lib/ruby/gems/2.2.0/gems/xapian-ruby-1.2.21/xapian-core-1.2.21'
Makefile:3312: recipe for target 'all-recursive' failed
make[1]: *** [all-recursive] Error 1
make[1]: Leaving directory '/tmp/ruby-xapian-ruby/pkg/ruby-xapian-ruby/usr/lib/ruby/gems/2.2.0/gems/xapian-ruby-1.2.21/xapian-core-1.2.21'
Makefile:1503: recipe for target 'all' failed
make: *** [all] Error 2
rake aborted!

/tmp/ruby-xapian-ruby/pkg/ruby-xapian-ruby/usr/lib/ruby/gems/2.2.0/gems/xapian-ruby-1.2.21/Rakefile:9:in `system!'
/tmp/ruby-xapian-ruby/pkg/ruby-xapian-ruby/usr/lib/ruby/gems/2.2.0/gems/xapian-ruby-1.2.21/Rakefile:30:in `block (2 levels) in <top (required)>'
/tmp/ruby-xapian-ruby/pkg/ruby-xapian-ruby/usr/lib/ruby/gems/2.2.0/gems/xapian-ruby-1.2.21/Rakefile:28:in `chdir'
/tmp/ruby-xapian-ruby/pkg/ruby-xapian-ruby/usr/lib/ruby/gems/2.2.0/gems/xapian-ruby-1.2.21/Rakefile:28:in `block in <top (required)>'
Tasks: TOP => default
(See full trace by running task with --trace)

rake failed, exit code 1

Gem files will remain installed in /tmp/ruby-xapian-ruby/pkg/ruby-xapian-ruby/usr/lib/ruby/gems/2.2.0/gems/xapian-ruby-1.2.21 for inspection.
Results logged to /tmp/ruby-xapian-ruby/pkg/ruby-xapian-ruby/usr/lib/ruby/gems/2.2.0/extensions/x86_64-linux/2.2.0/xapian-ruby-1.2.21/gem_make.out
==> ERROR: A failure occurred in package().