Search Criteria
Package Details: rucio-bootstrap 0.46.0-1
Package Actions
| Git Clone URL: | https://aur.archlinux.org/rucio.git (read-only, click to copy) |
|---|---|
| Package Base: | rucio |
| Description: | Decentralized P2P file sharing - DHT bootstrap node |
| Upstream URL: | https://github.com/ogarcia/rucio |
| Keywords: | dht emule kademlia p2p |
| Licenses: | GPL-3.0-or-later |
| Submitter: | ogarcia |
| Maintainer: | ogarcia |
| Last Packager: | ogarcia |
| Votes: | 1 |
| Popularity: | 0.077031 |
| First Submitted: | 2026-05-30 17:22 (UTC) |
| Last Updated: | 2026-09-25 14:12 (UTC) |
Dependencies (6)
- gcc-libs (gcc-libs-gitAUR, gccrs-libs-gitAUR, gcc-libs-fast-optimizedAUR, gcc-libs-snapshotAUR)
- cargo (rust-beta-binAUR, rustup-gitAUR, rust-gitAUR, rust, rustup) (make)
- git (git-gitAUR, git-glAUR, git-wd40AUR) (make)
- rust (rust-beta-binAUR, rustup-gitAUR, rust-gitAUR, rustup) (make)
- rust-wasm (rustup-gitAUR, rust-wasm-gitAUR, rustup) (make)
- trunk (trunk-lwt-binAUR) (make)
Latest Comments
mgmartins commented on 2026-09-06 08:54 (UTC)
Error while building (only paste last lines, but previous error is the same): error[E0425]: cannot find function, tuple struct or tuple variant
Somein this scope --> /home/ermanue/.cargo/registry/src/index.crates.io-1949cf8c6b5b557f/memchr-2.8.3/src/memmem/mod.rs:364:17 | 364 | Some(i) | ^^^^ not found in this scopeSome errors have detailed explanations: E0405, E0425, E0514, E0531. error: could not compile
memchr(lib) due to 439 previous errors 2026-09-06T08:53:27.693977Z ERROR ❌ error error from build pipelineCaused by: 0: HTML build pipeline failed (1 errors), showing first 1: error from asset pipeline 2: running cargo build 3: error during cargo build execution 4: cargo call to executable 'cargo' with args: '["build", "--target=wasm32-unknown-unknown", "--manifest-path", "/tmp/trizen-ermanue/rucio/src/rucio-0.44.0/rucio-web/Cargo.toml", "--release"]' returned a bad status: exit status: 101 2026-09-06T08:53:27.694036Z ERROR error from build pipeline 2026-09-06T08:53:27.694069Z INFO 1: HTML build pipeline failed (1 errors), showing first 2026-09-06T08:53:27.694080Z INFO 2: error from asset pipeline 2026-09-06T08:53:27.694091Z INFO 3: running cargo build 2026-09-06T08:53:27.694100Z INFO 4: error during cargo build execution 2026-09-06T08:53:27.694110Z INFO 5: cargo call to executable 'cargo' with args: '["build", "--target=wasm32-unknown-unknown", "--manifest-path", "/tmp/trizen-ermanue/rucio/src/rucio-0.44.0/rucio-web/Cargo.toml", "--release"]' returned a bad status: exit status: 101