Package Details: runelite 1:1.5.23-1

Git Clone URL: https://aur.archlinux.org/runelite.git (read-only)
Package Base: runelite
Description: Open source Old School RuneScape client.
Upstream URL: https://github.com/runelite/runelite
Licenses: BSD
Conflicts: runelite-git
Provides: runelite
Submitter: jcstryker
Maintainer: jcstryker
Last Packager: jcstryker
Votes: 11
Popularity: 0.124049
First Submitted: 2018-02-20 13:00
Last Updated: 2019-05-16 21:23

Dependencies (4)

Required by (0)

Sources (3)

Latest Comments

1 2 3 Next › Last »

Lekensteyn commented on 2019-03-23 23:57

Java 10 has a bug (see https://github.com/runelite/runelite/issues/3999), perhaps this package should just require java-runtime>=11?

Cheezers commented on 2019-03-04 09:01

Hi everyone, I'm a bit new with Linux and I tried to download this package, but Maven keeps throwing an error.

[INFO] ------------------------------------------------------------- [ERROR] COMPILATION ERROR : [INFO] ------------------------------------------------------------- [ERROR] No compiler is provided in this environment. Perhaps you are running on a JRE rather than a JDK? [INFO] 1 error [INFO] ------------------------------------------------------------- [INFO] ------------------------------------------------------------------------ [INFO] BUILD FAILURE [INFO] ------------------------------------------------------------------------ [INFO] Total time: 7.321 s [INFO] Finished at: 2019-03-04T09:49:50+01:00 [INFO] ------------------------------------------------------------------------ [ERROR] Failed to execute goal org.apache.maven.plugins:maven-compiler-plugin:3.1:compile (default-compile) on project launcher: Compilation failure [ERROR] No compiler is provided in this environment. Perhaps you are running on a JRE rather than a JDK? [ERROR]

I've added my Java-10-openjdk to the Java_home variable. This is the output of echo $JAVA_HOME: /usr/lib/jvm/java-10-openjdk/

mvn -version outputs: Apache Maven 3.6.0 (NON-CANONICAL_2018-11-06T03:14:22+01:00_root; 2018-11-06T03:14:22+01:00) Maven home: /opt/maven Java version: 10.0.2, vendor: Oracle Corporation, runtime: /usr/lib/jvm/java-10-openjdk Default locale: en_US, platform encoding: UTF-8 OS name: "linux", version: "4.20.11-1-manjaro", arch: "amd64", family: "unix"

Anyone know where I can fix this? (I'm kind of noob with Linux still)

I'm building the package with the package manager in Manjaro.

jeffhoe commented on 2019-03-01 01:27

@soalokin I tried building with java-10-openjdk and java-11-openjdk.. still failed. I wonder if its a permission issue (based on what the error is). I'm building it like I've always done -- wget the package, tar -xvf the package, cd to the directory, then makepkg -si.

soalokin commented on 2019-02-28 01:44

@jeffhoe try switching java environment to latest. That did it from me, I was using java-8-openjdk and build failed. But after switching to java-10-openjdk it was a success.

jeffhoe commented on 2019-02-25 18:24

Keep getting a build error. This has occurred the past 2 version so I've been using the runelite-launcher. Error list is much longer. Seems to be a directory error or something. Goes through all the files in runelite/src saying files not found... they're definitely there (ConfigManager for example).

[ERROR] /home/j-o/Documents/AURs/runelite/1:1.5.13-1/runelite/src/runelite-runelite-parent-1.5.13/runelite-client/src/main/java/net/runelite/client/config/ConfigManager.java:[66,36] package net.runelite.http.api.config does not exist [ERROR] /home/j-o/Documents/AURs/runelite/1:1.5.13-1/runelite/src/runelite-runelite-parent-1.5.13/runelite-client/src/main/java/net/runelite/client/config/ConfigManager.java:[68,2] cannot find symbol [ERROR] symbol: class Singleton [ERROR] /home/j-o/Documents/AURs/runelite/1:1.5.13-1/runelite/src/runelite-runelite-parent-1.5.13/runelite-client/src/main/java/net/runelite/client/config/ConfigManager.java:[69,2] cannot find symbol [ERROR] symbol: class Slf4j [ERROR] /home/j-o/Documents/AURs/runelite/1:1.5.13-1/runelite/src/runelite-runelite-parent-1.5.13/runelite-client/src/main/java/net/runelite/client/plugins/herbiboars/HerbiboarPlugin.java:[216,40] cannot find symbol [ERROR] symbol: class GameStateChanged [ERROR] location: class net.runelite.client.plugins.herbiboars.HerbiboarPlugin [ERROR] -> [Help 1] [ERROR] [ERROR] To see the full stack trace of the errors, re-run Maven with the -e switch. [ERROR] Re-run Maven using the -X switch to enable full debug logging. [ERROR] [ERROR] For more information about the errors and possible solutions, please read the following articles: [ERROR] [Help 1] <http://cwiki.apache.org/confluence/display/MAVEN/MojoFailureException> ==> ERROR: A failure occurred in build(). Aborting...

Shichimenchou commented on 2019-02-24 21:18

@jcstryker

That worked perfectly, thank you! I knew I must have been missing something big

jcstryker commented on 2019-02-24 00:00

@Shichimenchou

try adding:

-Dsun.java2d.noddraw=true -Dsun.java2d.opengl=false

to the /usr/bin/runelite script so it looks like this:

exec java -Dhttps.protocols=TLSv1.2 -Dsun.java2d.noddraw=true -Dsun.java2d.opengl=false -jar /usr/share/runelite/RuneLite.jar $@

The --mode=OFF is a launcher parameter. This package now builds the client from source without the launcher. Those two java parameters are what the launcher passes to the client when you pass --mode=off

https://github.com/runelite/launcher/blob/master/src/main/java/net/runelite/launcher/HardwareAccelerationMode.java#L57

Shichimenchou commented on 2019-02-23 23:28

I've notice the --mode=OFF option no longer works. Is there a new method to disable hardware acceleration?

When I try to use that option I get this error

Exception in thread "main" joptsimple.UnrecognizedOptionException: Mode is not a recognized option

at joptsimple.OptionException.unrecognizedOption(OptionException.java:108)

at joptsimple.OptionParser.handleLongOptionToken(OptionParser.java:510)

at joptsimple.OptionParserState$2.handleArgument(OptionParserState.java:56)

at joptsimple.OptionParser.parse(OptionParser.java:396)

at net.runelite.client.RuneLite.main(RuneLite.java:178

jcstryker commented on 2019-02-07 23:44

@kubetz my mistake, forgot to update the sha512

kubetz commented on 2019-02-07 23:39

Build is failing for me on the verification of the runelite-parent-1.5.11.tar.gz which seems to have sha512sum 'fdf098392eaf9b17325f986e82d7b886c810cbfe9771e630667118c335711b23019741feda86964361bd838eb3c7648d763cd99846ca766aa9460f47b70e62bd' instead of the one defined in the PKGBUILD file.