Package Details: saga-gis-ltr 2.3.1-1

Git Clone URL: (read-only, click to copy)
Package Base: saga-gis-ltr
Description: A Geographic Information System (GIS) software with immense capabilities for geodata processing and analysis. Compactible with QGIS
Upstream URL:
Keywords: GIS
Licenses: GPL3
Conflicts: saga-gis
Provides: saga-gis
Submitter: geosam
Maintainer: sptzmllr
Last Packager: pat-s
Votes: 5
Popularity: 0.000000
First Submitted: 2017-07-28 21:08 (UTC)
Last Updated: 2018-09-10 20:53 (UTC)

Latest Comments

zooxs commented on 2021-06-12 13:39 (UTC)

I'v encountered an error. Here it's

table.cpp:904:23: error: ordered comparison of pointer with integer zero (‘CSG_Table_Record**’ and ‘int’) 904 | if( m_Records > 0 )

I have no idea whats going on and i didn't have knowledge on cpp languages. So i appreciate if anyone can help me.

NicolaP commented on 2020-06-12 10:29 (UTC)

I've encountered an error in building phase: make[5]: [Makefile:544: ogr_driver.lo] Errore 1 make[5]: Attesa per i processi non terminati.... make[5]: uscita dalla directory «/var/tmp/pamac-build-nicola/saga-gis-ltr/src/saga-2.3.1/src/modules/io/io_gdal» make[4]: [Makefile:394: all-recursive] Errore 1 make[4]: uscita dalla directory «/var/tmp/pamac-build-nicola/saga-gis-ltr/src/saga-2.3.1/src/modules/io» make[3]: [Makefile:392: all-recursive] Errore 1 make[3]: uscita dalla directory «/var/tmp/pamac-build-nicola/saga-gis-ltr/src/saga-2.3.1/src/modules» make[2]: [Makefile:392: all-recursive] Errore 1 make[2]: uscita dalla directory «/var/tmp/pamac-build-nicola/saga-gis-ltr/src/saga-2.3.1/src» make[1]: [Makefile:498: all-recursive] Errore 1 make[1]: uscita dalla directory «/var/tmp/pamac-build-nicola/saga-gis-ltr/src/saga-2.3.1» make: *** [Makefile:409: all] Errore 2 ==> ERRORE: Si è verificato un errore in build(). L'operazione sta per essere interrotta... Could you help me?

pat-s commented on 2019-11-10 15:13 (UTC)

The 2.x series will not gain support for PROJ6. One needs to provide PROJ <= 5.x t get this build running again. I do not have time for this and will disown this package therefore.

pat-s commented on 2018-08-07 11:52 (UTC)

I see

make[5]: *** [Makefile:558: Grid_IMCORR.lo] Error 1

error while loading shared libraries: cannot open shared object file: No such file or directory

Stormrider commented on 2018-03-05 21:46 (UTC)

I switched the source to: and it worked

languitar commented on 2018-03-05 21:39 (UTC)

Is there a reason why the number of make jobs is hard-coded in the PKGBUILD?

languitar commented on 2018-03-05 21:37 (UTC)

This should probably not hard-code a mirror.

pat-s commented on 2018-03-01 12:55 (UTC)


curl: (60) SSL certificate problem: certificate has expired More details here:

curl failed to verify the legitimacy of the server and therefore could not establish a secure connection to it. To learn more about this situation and how to fix it, please visit the web page mentioned above. ==> ERROR: Failure while downloading Aborting...