Package Details: sane-git 1.1.1.r418.g9d721e461-1

Git Clone URL: (read-only, click to copy)
Package Base: sane-git
Description: Scanner Access Now Easy
Upstream URL:
Licenses: GPL
Conflicts: sane
Provides: sane
Submitter: Miegl
Maintainer: tallero
Last Packager: tallero
Votes: 4
Popularity: 0.000000
First Submitted: 2018-12-27 19:32 (UTC)
Last Updated: 2023-08-28 19:29 (UTC)

Required by (118)

Sources (4)

Latest Comments

1 2 Next › Last »

xiota commented on 2023-04-11 22:52 (UTC) (edited on 2023-04-11 23:18 (UTC) by xiota)

checking for a Python interpreter with version >= 2.7... none
configure: error: no suitable Python interpreter found
==> ERROR: A failure occurred in build().

Fix by copying depends and makedepends from extra/sane.

$srcdir can contain spaces and should be guarded by quotes.

Would be worth reviewing and updating rest of package for additional changes.

I am willing to fix and clean up this package if made comaintainer.

xiota commented on 2022-10-07 02:31 (UTC) (edited on 2023-04-11 16:25 (UTC) by xiota)

Please change pkgver() to use git describe --long --tags | sed 's/\([^-]*-g\)/r\1/;s/-/./g' instead of the date of the last commit.

  • Commit dates can be out of order.
  • Version will be comparable to the release versions. 1.1.1.r333.gb2a5a41be is 333 commits after release 1.1.1.

milaxnuts commented on 2020-12-28 14:36 (UTC)

remove patch -Np1 -i ${srcdir}/network.patch from PKGBUILD, works for me

strubbl commented on 2020-10-22 17:12 (UTC) (edited on 2020-10-22 17:13 (UTC) by strubbl)

Now there's also a dependency problem with libusbx. :(

strubbl commented on 2020-07-27 21:22 (UTC)

I have exactly the same problem as described by fossanico. Can't this be fixed anyhow?

nfs commented on 2020-06-15 22:59 (UTC)

I am getting the same problem as fossanico. Any suggestions?

fossanico commented on 2020-06-05 16:34 (UTC)

I get an error when trying to install:

==> Starting prepare()...
patching file sanei/sanei_tcp.c
Hunk #1 FAILED at 45.
Hunk #2 FAILED at 123.
2 out of 2 hunks FAILED -- saving rejects to file sanei/sanei_tcp.c.rej

I think that the patch should be updated.

strubbl commented on 2019-07-16 21:22 (UTC)

sorry for flagging, this was done by mistake.

Miegl commented on 2019-07-16 20:51 (UTC)

strubbl: thanks for the report, updated the package.

strubbl commented on 2019-07-16 13:25 (UTC) (edited on 2019-07-16 14:02 (UTC) by strubbl)

i get an error:

==> Starting build()...
/home/strubbl/.cache/pikaur/build/sane-git/PKGBUILD: line 45: ./configure: No such file or directory
==> ERROR: A failure occurred in build().

looks like the backend project switched to autotools for building and does not provide the intermediate build artifacts via repository.

i opened an issue for the outdated build instructions: