Package Details: sasview 5.0.6-1

Git Clone URL: (read-only, click to copy)
Package Base: sasview
Description: Small-Angle Scattering Analysis
Upstream URL:
Licenses: BSD
Submitter: awacha
Maintainer: awacha
Last Packager: awacha
Votes: 0
Popularity: 0.000000
First Submitted: 2019-07-22 12:53 (UTC)
Last Updated: 2023-11-27 09:28 (UTC)

Latest Comments

MarsSeed commented on 2023-11-25 12:47 (UTC)

Please remove and disable checkdepend python-unittest-xml-reporting: abandoned by upstream, not compatible with Python 3.11, fails to build.

micwoj92 commented on 2023-03-12 12:50 (UTC)

Check fails

==> Starting check()...
matplotlib: DEBUG: matplotlib data path: /usr/lib/python3.10/site-packages/matplotlib/mpl-data
matplotlib: DEBUG: CONFIGDIR=/home/micwoj92/.config/matplotlib
matplotlib: DEBUG: interactive is False
matplotlib: DEBUG: platform is linux
Result for utest_corfunc: SUCCESS
Result for utest_sesans: SUCCESS
Result for utest_extension_registry: SUCCESS
Result for utest_ascii: SUCCESS
Result for utest_generic_file_reader_class: SUCCESS
Result for utest_averaging: SUCCESS
Result for utest_red2d_reader: SUCCESS
Result for utest_abs_reader: SUCCESS
Result for utest_cansas: SUCCESS
Result for utest_explorer: FAILED    pr_inversion/
Result for utest_invertor: FAILED    pr_inversion/
Result for utest_use_cases: SUCCESS
Result for utest_data_handling: SUCCESS
Result for utest_manipulations: SUCCESS
Result for utest_nxcansas_writer: SUCCESS
Result for utest_bsl_loader: SUCCESS
Result for utest_sld: SUCCESS
Result for utest_resolution_calculator: SUCCESS
Result for utest_slit_length_calculator: SUCCESS
Result for utest_sas_gen: SUCCESS

Results by test modules:
    PASSED: 18
    FAILED: 2    (10%)
Results by tests:
    Tests run:    143
    Tests failed: 0
    Test errors:  0

==> ERROR: A failure occurred in check().