Package Details: scangearmp-mg6200 1.80-4

Git Clone URL: https://aur.archlinux.org/scangearmp-mg6200.git (read-only, click to copy)
Package Base: scangearmp-mg6200
Description: Canon Scanner Driver (for mg6200 series)
Upstream URL: http://support-au.canon.com.au/contents/AU/EN/0100393102.html
Licenses: custom
Submitter: Lopo
Maintainer: Lopo
Last Packager: Lopo
Votes: 3
Popularity: 0.000001
First Submitted: 2012-03-20 13:33 (UTC)
Last Updated: 2019-10-03 17:25 (UTC)

Latest Comments

commented on 2013-09-20 18:03 (UTC)

To resolve my build problem I copied libcncpnet.so and libcncpmsui.so to /usr/lib (from the libs_bin64 dir) then everything built ok. Then I had to remove the files copied to /usr/lib to be able to install the built package, everything works now.

commented on 2013-09-17 18:48 (UTC)

I get the following when trying to execute makepkg: /usr/bin/ld: cannot find -lcncpnet collect2: error: ld returned 1 exit status make[1]: *** [libsane-canon_mfp.la] Error 1 make[1]: Leaving directory `/home/<user>/Downloads/scangearmp-mg6200/src/scangearmp-source-1.80-1/scangearmp/backend' make: *** [all-recursive] Error 1 ==> ERROR: A failure occurred in build(). Aborting... Any help is really appreciated!