Package Details: scribus-devel 1.5.4-1

Git Clone URL: https://aur.archlinux.org/scribus-devel.git (read-only)
Package Base: scribus-devel
Description: Desktop publishing software
Upstream URL: https://www.scribus.net/
Licenses: GPL
Conflicts: scribus
Provides: scribus
Submitter: ArchangeGabriel
Maintainer: ArchangeGabriel
Last Packager: ArchangeGabriel
Votes: 13
Popularity: 1.093848
First Submitted: 2016-12-26 02:49
Last Updated: 2018-05-02 21:57

Latest Comments

ArchangeGabriel commented on 2018-05-02 09:13

You didn’t paste the relevant part. But note that you cannot currently build 1.5.4 because of a bug in the code w.r.t. our poppler version. I’m working with upstream on this.

bm456 commented on 2018-05-02 00:04

i found this at 1.54 :)

https://p.teknik.io/Qa6Gv

ArchangeGabriel commented on 2018-04-29 10:19

I’ve noticed the OOD flag, but currently the GPG signature is wrong, so I’m waiting for upstream reply about this before updating.

TilmanV commented on 2018-03-31 20:33

As a temporary fix pls add

{ echo 'add_definitions(-DU_USING_ICU_NAMESPACE=1)'; cat CMakeLists.txt; } >CMakeLists.txt.new
mv CMakeLists.txt{.new,}

to the end of prepare()

alexmerry commented on 2018-03-31 19:14

This fails to build against the latest libicu (see http://source.icu-project.org/repos/icu/trunk/icu4c/readme.html#RecBuild).

The solution is to make sure -DU_USING_ICU_NAMESPACE=1 is defined for the build - I added the line

add_definitions(-DU_USING_ICU_NAMESPACE=1)

to the CMakeLists.txt, but there are other ways of doing it as well.

ArchangeGabriel commented on 2017-10-27 17:58

This was an issue with `poppler >= 0.58` (we are now at `0.60`). I’ve added a patch from upstream to solve this, please retry.

aer0s commented on 2017-10-24 14:56

Build dies on building importpdf plugin with:
make[2]: *** [scribus/plugins/import/pdf/CMakeFiles/importpdf.dir/build.make:78: scribus/plugins/import/pdf/CMakeFiles/importpdf.dir/importpdf.cpp.o] Error 1
make[1]: *** [CMakeFiles/Makefile2:1810: scribus/plugins/import/pdf/CMakeFiles/importpdf.dir/all] Error 2
make: *** [Makefile:152: all] Error 2

Any ideas?

dmdobrowolski commented on 2017-09-17 15:31

UPD successfully rebuilt and run after removing graphicsmagick from my system.

dmdobrowolski commented on 2017-09-16 19:04

@ArchangeGabriel:
Scribus crashes on start. An error message says:
magick/error.c:921: ThrowLoggedException: Assertion `exception->signature == MagickSignature' failed

ArchangeGabriel commented on 2017-08-06 15:35

It builds fine for me here (in a clean chroot), you’ll have to be more specific (paste build log somewhere and link it here).

All comments