Package Details: scribus-svn 23065-1

Git Clone URL: https://aur.archlinux.org/scribus-svn.git (read-only)
Package Base: scribus-svn
Description: A desktop publishing program - Version from SVN
Upstream URL: http://www.scribus.net
Licenses: GPL, LGPL
Conflicts: scribus
Provides: scribus
Submitter: None
Maintainer: haawda
Last Packager: haawda
Votes: 50
Popularity: 0.000015
First Submitted: 2008-04-27 21:07
Last Updated: 2019-07-04 17:20

Latest Comments

« First ‹ Previous 1 2 3 4 5 6 7 8 9 10 Next › Last »

haawda commented on 2014-09-18 17:52

I think this issue is related to the recent update of the qt5 stuff. So downgrading might help for the moment.

Alternatively you can write a mail to the scribus mailing list for advice.

Kopfknoten commented on 2014-09-18 10:33

Does anybody know how to fix this?

Kopfknoten commented on 2014-09-17 22:17

Building stops at 77%.

"/usr/bin/ld: CMakeFiles/scribus.dir/ui/helpbrowser.cpp.o: undefined reference to symbol '_ZN12QPrintDialogC1EP8QPrinterP7QWidget'
/usr/lib/libQt5PrintSupport.so.5: error adding symbols: DSO missing from command line
collect2: Fehler: ld gab 1 als Ende-Status zurück
scribus/CMakeFiles/scribus.dir/build.make:20871: recipe for target 'scribus/scribus' failed
make[2]: *** [scribus/scribus] Error 1
CMakeFiles/Makefile2:145: recipe for target 'scribus/CMakeFiles/scribus.dir/all' failed
make[1]: *** [scribus/CMakeFiles/scribus.dir/all] Error 2
Makefile:137: recipe for target 'all' failed
make: *** [all] Error 2"

German line "Fehler: ld gab 1 als Ende-Status zurück" translates to something like "Failure: ld gave back the End-Status 1"

haawda commented on 2014-09-10 19:46

Upstream fixed it, so I removed the patch again.

haawda commented on 2014-09-10 16:59

Upstream error, in scribus' bugtracker a fix is given. I am currently rebuilding, applying it.

cspal commented on 2014-09-10 11:07

Hi,

I just try to build this package but get error message:

/home/cspal/tmp/yaourt/yaourt-tmp-cspal/aur-scribus-svn/src/scribus/Scribus/scribus/scribus.cpp:98:27: fatal error: appModeHelper.h: No such file or directory
#include "appModeHelper.h"
^
compilation terminated.
scribus/CMakeFiles/scribus.dir/build.make:12909: recipe for target 'scribus/CMakeFiles/scribus.dir/scribus.cpp.o' failed
make[2]: *** [scribus/CMakeFiles/scribus.dir/scribus.cpp.o] Error 1
CMakeFiles/Makefile2:145: recipe for target 'scribus/CMakeFiles/scribus.dir/all' failed
make[1]: *** [scribus/CMakeFiles/scribus.dir/all] Error 2
Makefile:137: recipe for target 'all' failed
make: *** [all] Error 2
==> HIBA: Error in build ().
Interruption...
==> ERROR: Makepkg was unable to build scribus-svn.
==> Restart building scribus-svn ? [y/N]

Well, what is the solution for this problem?

haawda commented on 2014-06-27 20:43

I have an idea what went wrong for you, but please put an LANG=C somewhere into the build function in order to get english error messages next time.

Please test again, I put the python related stuff into a prepare function.

haawda commented on 2014-06-27 19:17

I have an idea what wen wrong for you, but please put an LANG=C somewhere into the build fuction in order to get english error messages.

osc commented on 2014-06-27 16:41

gives this error:

sed: não foi possível ler /tmp/yaourt-tmp-osc/aur-scribus-svn/pkg/scribus-svn/usr/share/scribus/scripts/*.py: Arquivo ou diretório não encontrado
==> ERRO: Uma falha ocorreu em package().
Abortando...
==> ERRO: Makepkg não conseguiu compilar scribus-svn

haawda commented on 2014-02-18 17:28

I corrected some dependencies and removed some unused -D directives.

kozaki, I cannot reproduce your problem. Try without yaourt.