Package Details: sha3sum-git

Git Clone URL: (read-only)
Package Base: sha3sum-git
Description: Checksum utility for Keccak and its close derivatives SHA-3, SHAKE and RawSHAKE
Upstream URL:
Licenses: AGPL3
Submitter: onny
Maintainer: None
Last Packager: gavinhungry
Votes: 8
Popularity: 0.536606
First Submitted: 2013-03-05 17:28
Last Updated: 2017-02-24 19:46

Dependencies (5)

Required by (0)

Sources (1)

Latest Comments

fightcookie commented on 2017-07-20 16:31

build error:

auto-auto-complete fish --output bin/ --source src/completion command=sha3-512sum
auto-auto-complete fish --output bin/ --source src/completion command=rawshake256sum
auto-auto-complete fish --output bin/ --source src/completion command=rawshake512sum
auto-auto-complete fish --output bin/ --source src/completion command=shake256sum
auto-auto-complete fish --output bin/ --source src/completion command=shake512sum
cd obj/info ; makeinfo ../../doc/sha3sum.texinfo
cat doc/xsum.texman | sed -e 's/xsum/keccak-224sum/g' -e 's/XSUM/Keccak-224/g' | texman > bin/keccak-224sum.1
cat doc/xsum.texman | sed -e 's/xsum/keccak-256sum/g' -e 's/XSUM/Keccak-256/g' | texman > bin/keccak-256sum.1
Unescaped left brace in regex is illegal here in regex; marked by <-- HERE in m/\@{ <-- HERE / at /usr/bin/texman line 51.
cat doc/xsum.texman | sed -e 's/xsum/keccak-384sum/g' -e 's/XSUM/Keccak-384/g' | texman > bin/keccak-384sum.1
Unescaped left brace in regex is illegal here in regex; marked by <-- HERE in m/\@{ <-- HERE / at /usr/bin/texman line 51.
make: *** [Makefile:124: bin/keccak-224sum.1] Error 255
make: *** Waiting for unfinished jobs....
make: *** [Makefile:124: bin/keccak-256sum.1] Error 255
Unescaped left brace in regex is illegal here in regex; marked by <-- HERE in m/\@{ <-- HERE / at /usr/bin/texman line 51.
make: *** [Makefile:124: bin/keccak-384sum.1] Error 255
mv obj/info/ bin/
rm obj/keccaksum.o obj/sha3-512sum.o obj/keccak-512sum.o obj/shake256sum.o obj/rawshake256sum.o obj/sha3-384sum.o obj/keccak-384sum.o obj/shake512sum.o obj/sha3-256sum.o obj/keccak-256sum.o obj/rawshake512sum.o obj/sha3-224sum.o obj/keccak-224sum.o obj/common.o
==> ERROR: A failure occurred in build().
:: texlive-core is now an optional package
:: failed to build sha3sum-git package(s)

gavinhungry commented on 2015-04-06 04:09

@maandree, thanks! Updated the PKGBUILD.

maandree commented on 2015-04-06 02:20

I have fixed the problem.

@gavinhungry, you do not need to install all files manually, the makefile has rules for installation. And if you do not want the install a pdf, a dvi and a ps version of the info manual `make default man` (and `make install install-man`) will do.

Det commented on 2015-04-04 04:35

Should we report a bug?

gavinhungry commented on 2015-04-03 18:02

@Det, I think it's fixed now.

See changes here:

See the following for more information:

gavinhungry commented on 2015-04-03 17:06

@Det, I'm seeing this as well, although (sometimes?) I can do it with only 2 runs of makepkg ... weird. I'll look into it.

Det commented on 2015-04-01 00:10

I don't know what's wrong with it. I can build just fine manually by doing a 'make all' (same as 'make default doc', right?:, but makepkg wants me to run a total of 3 times, until everything gets built:

1st run (full):

gavinhungry commented on 2015-02-11 18:58

@Det, try 0.228.8fc3a72-1

gavinhungry commented on 2015-02-11 18:56

Looks like it needs mktexfmt, which is in texlive-core (texlive-bin is a dep). I can build it as-is on my machine (likely because I already have those deps installed). I'll add texlive-core to makedepends, let me know how that works out for you.

Det commented on 2015-02-07 17:00

Also makedepends on 'texlive-bin', but it's still failing:

All comments