Package Details: sharpconstruct 0.12-5

Git Clone URL: https://aur.archlinux.org/sharpconstruct.git (read-only)
Package Base: sharpconstruct
Description: Create 3D models by sculpting
Upstream URL: http://sourceforge.net/projects/sharp3d/
Licenses: GPL2
Submitter: xyproto
Maintainer: None
Last Packager: xyproto
Votes: 5
Popularity: 0.000000
First Submitted: 2009-05-09 15:55
Last Updated: 2015-06-10 12:35

Latest Comments

RastaManKing commented on 2016-06-02 23:42

i get following error trying to install:

Makefile:344: recipe for target 'Deformations.o' failed
make[1]: *** [Deformations.o] Error 1/src/sharpconstruct-0.12/src'
Makefile:227: recipe for target 'all-recursive' failed
make: *** [all-recursive] Error 1
==> ERROR: A failure occurred in build().
Aborting...
==> ERROR: Makepkg was unable to build sharpconstruct.

RastaManKing commented on 2016-02-22 09:30

i get the following error trying to install..

Makefile:344: recipe for target 'Brush.o' failed
make[1]: *** [Brush.o] Error 1
make[1]: Leaving directory '/tmp/yaourt-tmp-rastamanking/aur-sharpconstruct/src/sharpconstruct-0.12/src'
Makefile:227: recipe for target 'all-recursive' failed
make: *** [all-recursive] Error 1


any help appreciated.

Anonymous comment on 2011-04-08 08:32

(On x86_64) The problem has solved itself after an upgrade (pacman -Syu), the last upgrade I did was the 6th of April.

xyproto commented on 2011-04-07 16:11

Autogyro, are you on x86_64 or i686? If you're on i686, I may change the PKGBUILD so that it uses multilibs for that architecture.

xyproto commented on 2011-04-04 13:45

Removed gcc-multilib-libs from dependencies and did not add gcc-multilib to build deps, as it built fine here without those.
Autogyro, if you remove everything called something with "gcc-multilib", does this package work for you?

Anonymous comment on 2010-11-05 20:57

I'm glad I was helpful!

xyproto commented on 2010-09-29 12:23

Thank you fda, I incorporated the changes you suggested in arch.path.

Anonymous comment on 2010-09-21 22:18

In MainWindow.cc search for:
void MainWindow::on_speed_test_clicked_()
and search into for:
Gtk::MessageDialog::MessageDialog( *mw, "Times:\n" + output + "\nAverage: " + ToString( adder / runs ) + " seconds" ).run();
and change for:
Gtk::MessageDialog md( *mw, "Times:\n" + output + "\nAverage: " + ToString( adder / runs ) + " seconds" , false, Gtk::MESSAGE_WARNING, Gtk::BUTTONS_OK );
md.run();
then few lines down search for:
Gtk::MessageDialog::MessageDialog( *mw, ToString( timer.elapsed() ) + " seconds" ).run();
and change for:
Gtk::MessageDialog md(*mw, ToString(timer.elapsed())+ " seconds" , false, Gtk::MESSAGE_WARNING, Gtk::BUTTONS_OK );
md.run();
save
make
make install
the aplication is located at: /usr/local/bin/sharpconstruct


it works for me.
greetings from Spain and sorry by my English.

Anonymous comment on 2010-05-17 20:27

I got:

MainWindow.cc: In member function ‘void SharpConstruct::GInterface::MainWindow::on_speed_test_clicked_()’:
MainWindow.cc:949:21: error: cannot call constructor ‘Gtk::MessageDialog::MessageDialog’ directly
MainWindow.cc:949:21: error: for a function-style cast, remove the redundant ‘::MessageDialog’
MainWindow.cc:971:84: error: cannot call constructor ‘Gtk::MessageDialog::MessageDialog’ directly
MainWindow.cc:971:84: error: for a function-style cast, remove the redundant ‘::MessageDialog’
make[1]: *** [MainWindow.o] Error 1
make[1]: Leaving directory `/tmp/yaourt-tmp-hannes/aur-sharpconstruct/sharpconstruct/src/sharpconstruct-0.12/src'
make: *** [all-recursive] Error 1
==> ERROR: Build Failed.
Aborting...
Error: Makepkg was unable to build sharpconstruct package.