Package Details: shortwave-git 2.0.1.r183.g851fb6b-1

Git Clone URL: https://aur.archlinux.org/shortwave-git.git (read-only, click to copy)
Package Base: shortwave-git
Description: Find and listen to internet radio stations
Upstream URL: https://apps.gnome.org/app/de.haeckerfelix.Shortwave
Licenses: GPL3
Conflicts: shortwave
Provides: shortwave
Submitter: flipflop97
Maintainer: yochananmarqos
Last Packager: yochananmarqos
Votes: 8
Popularity: 0.012320
First Submitted: 2019-01-30 20:00 (UTC)
Last Updated: 2022-03-22 20:16 (UTC)

Latest Comments

yochananmarqos commented on 2022-04-24 00:22 (UTC)

@ewout: If you don't want to help test the bleeding edge version to help development, use the stable version.

ewout commented on 2022-04-15 09:37 (UTC)

Please change the -Dprofile=development option passed to arch-meson during the build() phase to default. To lose the development theming, to have it better integrate with the other regular GNOME apps.

freebench commented on 2021-11-04 14:09 (UTC)

Failed error: linking with cc failed: exit status: 1

==> Making package: shortwave-git 2.0.1.r136.gb7fb377-1 (Thu 04 Nov 2021 04:02:44 PM EET)
==> Checking runtime dependencies...
==> Checking buildtime dependencies...
==> Retrieving sources...
  -> Updating Shortwave git repo...
Fetching origin
==> Validating source files with sha256sums...
    Shortwave ... Skipped
==> Extracting sources...
  -> Creating working copy of Shortwave git repo...
Switched to a new branch 'makepkg'
==> Starting prepare()...
==> Starting pkgver()...
==> Removing existing $pkgdir/ directory...
==> Starting build()...
+ exec meson setup --prefix /usr --libexecdir lib --sbindir bin --buildtype plain --auto-features enabled --wrap-mode nodownload -D b_lto=true -D b_pie=true Shortwave build -Dprofile=development
Directory already configured.

Just run your build command (e.g. ninja) and Meson will regenerate as necessary.
If ninja fails, run "ninja reconfigure" or "meson --reconfigure"
to force Meson to regenerate.

If build failures persist, run "meson setup --wipe" to rebuild from scratch
using the same options as passed when configuring the build.
To change option values, run "meson configure" instead.
ninja: Entering directory `/home/admin/aur/shortwave-git/src/build'
[0/1] Generating src/cargo-build with a custom command
** RUST VERSION **
rustc 1.56.0
** DEBUG MODE **
   Compiling shortwave v0.0.0 (/home/admin/aur/shortwave-git/src/Shortwave)
error: linking with `cc` failed: exit status: 1
  |
  = note: "cc" "-m64" "/home/admin/aur/shortwave-git/src/build/target/debug/deps/shortwave-e139f764d70b23e4.105kal0n4lcvpv8g.rcgu.o" "/home/admin/aur/shortwave-git/src/build/target/debug/deps/shortwave-e139f764d70b23e4.10eat77ko9zf6n75.rcgu.o" "/home/admin/aur/shortwave-git/src/build/target/debug/deps/shortwave-e139f764d70b23e4.125xcgd035vdda04.rcgu.o" "/home/admin/aur/shortwave-git/src/build/target/debug/deps/shortwave-e139f764d70b23e4.14apb6az4gahgsn2.rcgu.o" "/home/admin/aur/shortwave-git/src/build/target/debug/deps/shortwave-e139f764d70b23e4.14hejdnoszludj20.rcgu.o" "/home/admin/aur/shortwave-git/src/build/target/debug/deps/shortwave-e139f764d70b23e4.14tc9v4f40yj55it.rcgu.o" "/home/admin/aur/shortwave-git/src/build/target/debug/deps/shortwave-e139f764d70b23e4.14wae0ldd7pc90gv.rcgu.o" "/home/admin/aur/shortwave-git/src/build/target/debug/deps/shortwave-e139f764d70b23e4.15bvjt9q8ymtt5ym.rcgu.o" "/home/admin/aur/shortwave-git/src/build/target/debug/deps/shortwave-e139f764d70b23e4.1645te4f94xn5e9f.rcgu.o" "/home/admin/aur/shortwave-git/src/build/target/debug/deps/shortwave-e139f764d70b23e4.16rey9i6dvzgg8nm.rcgu.o" "/home/admin/aur/shortwave-git/src/build/target/debug/deps/shortwave-e139f764d70b23e4.17kqfrfopaei19jk.rcgu.o" "/home/admin/aur/shortwave-git/src/build/target/debug/deps/shortwave-e139f764d70b23e4.18lmiuwbgs4oaihq.rcgu.o" "/home/admin/aur/shortwave-git/src/build/target/debug/deps/shortwave-e139f764d70b23e4.18yta64mvmmaxw74.rcgu.o" "/home/admin/aur/shortwave-git/src/build/target/debug/deps/shortwave-e139f764d70b23e4.19eeb0drhy3oe5ze.rcgu.o" "/home/admin/aur/shortwave-git/src/build/target/debug/deps/shortwave-e139f764d70b23e4.1a4i5agc03rycemv.rcgu.o" "/home/admin/aur/shortwave-git/src/build/target/debug/deps/shortwave-e139f764d70b23e4.1a6oslnldvnidwok.rcgu.o" "/home/admin/aur/shortwave-git/src/build/target/debug/deps/shortwave-e139f764d70b23e4.1a8t1yaa0awfw45g.rcgu.o" "/home/admin/aur/shortwave-git/src/build/target/debug/deps/shortwave-e139f764d70b23e4.1b73w4i8wvauw5pw.rcgu.o" "/home/admin/aur/shortwave-git/src/build/target/debug/deps/shortwave-e139f764d70b23e4.1bl7fuxg2e8pelxq.rcgu.o" "/home/admin/aur/shortwave-git/src/build/target/debug/deps/shortwave-e139f764d70b23e4.1cm14nk9isf2403u.rcgu.o" "/home/admin/aur/shortwave-git/src/build/target/debug/deps/shortwave-e139f764d70b23e4.1cu65hxp0ksblmzd.rcgu.o" "/home/admin/aur/shortwave-git/src/build/target/debug/deps/shortwave-e139f764d70b23e4.1da1anbfldhlfvtl.rcgu.o" "/home/admin/aur/shortwave-git/src/build/target/debug/deps/shortwave-e139f764d70b23e4.1dtu4zefe6t6af3l.rcgu.o" "/home/admin/aur/shortwave-git/src/build/target/debug/deps/shortwave-e139f764d70b23e4.1e05ghvyy76xxxmx.rcgu.o" "/home/admin/aur/shortwave-git/src/build/target/debug/deps/shortwave-e139f764d70b23e4.1elwk51fi5sfdqd1.rcgu.o" "/home/admin/aur/shortwave-git/src/build/target/debug/deps/shortwave-e139f764d70b23e4.1fhts46em9eor8h3.rcgu.o" "/home/admin/aur/shortwave-git/src/build/target/debug/deps/shortwave-e139f764d70b23e4.1gn7q6p90qgtsvl9.rcgu.o" "/home/admin/aur/shortwave-git/src/build/target/debug/deps/shortwave-e139f764d70b23e4.1gqqgy62btru96rx.rcgu.o" "/home/admin/aur/shortwave-git/src/build/target/debug/deps/shortwave-e139f764d70b23e4.1iom80ns4nuafpqy.rcgu.o" "/home/admin/aur/shortwave-git/src/build/target/debug/deps/shortwave-e139f764d70b23e4.1it3md4sxqlhkkc5.rcgu.o" "/home/admin/aur/shortwave-git/src/build/target/debug/deps/shortwave-e139f764d70b23e4.1iy8qxr2nncd1tu4.rcgu.o" "/home/admin/aur/shortwave-git/src/build/target/debug/deps/shortwave-e139f764d70b23e4.1j2hwyuagulskm2s.rcgu.o" "/home/admin/aur/shortwave-git/src/build/target/debug/deps/shortwave-e139f764d70b23e4.1j6jzo7xybdkcdyg.rcgu.o" "/home/admin/aur/shortwave-git/src/build/target/debug/deps/shortwave-e139f764d70b23e4.1j81y36pg24qatxp.rcgu.o" "/home/admin/aur/shortwave-git/src/build/target/debug/deps/shortwave-e139f764d70b23e4.1jmmb4e9ptwninx3.rcgu.o" "/home/admin/aur/shortwave-git/src/build/target/debug/deps/shortwave-e139f764d70b23e4.1k1x9du774fcjfq6.rcgu.o" "/home/admin/aur/shortwave-git/src/build/target/debug/deps/shortwave-e139f764d70b23e4.1lh0pfrfmgwbfl8v.rcgu.o" "/home/admin/aur/shortwave-git/src/build/target/debug/deps/shortwave-e139f764d70b23e4.1n851zodfd5nmwyk.rcgu.o" "/home/admin/aur/shortwave-git/src/build/target/debug/deps/shortwave-e139f764d70b23e4.1nhappdlcncu772z.rcgu.o" "/home/admin/aur/shortwave-git/src/build/target/debug/deps/shortwave-e139f764d70b23e4.1nkeb9w1e5p8jgq5.rcgu.o" "/home/admin/aur/shortwave-git/src/build/target/debug/deps/shortwave-e139f764d70b23e4.1o4polqfs0bzl2fu.rcgu.o" "/home/admin/aur/shortwave-git/src/build/target/debug/deps/shortwave-e139f764d70b23e4.1orxajccnjzccs35.rcgu.o" "/home/admin/aur/shortwave-git/src/build/target/debug/deps/shortwave-e139f764d70b23e4.1pqf48vqv7i2fp1r.rcgu.o" "/home/admin/aur/shortwave-git/src/build/target/debug/deps/shortwave-e139f764d70b23e4.1pzgfgzumbmdwrlt.rcgu.o" "/home/admin/aur/shortwave-git/src/build/target/debug/deps/shortwave-e139f764d70b23e4.1qafa30pxgomy5s1.rcgu.o" "/home/admin/aur/shortwave-git/src/build/target/debug/deps/shortwave-e139f764d70b23e4.1rfjntl8dvoamn1n.rcgu.o" "/home/admin/aur/shortwave-git/src/build/target/debug/deps/shortwave-e139f764d70b23e4.1tcb7pyfp8849821.rcgu.o" "/home/admin/aur/shortwave-git/src/build/target/debug/deps/shortwave-e139f764d70b23e4.1udobsohnv990jyp.rcgu.o" "/home/admin/aur/shortwave-git/src/build/target/debug/deps/shortwave-e139f764d70b23e4.1uitluvwz5il7r83.rcgu.o" "/home/admin/aur/shortwave-git/src/build/target/debug/deps/shortwave-e139f764d70b23e4.1wj9tisbktuz5ci1.rcgu.o" "/home/admin/aur/shortwave-git/src/build/target/debug/deps/shortwave-e139f764d70b23e4.1xlsyyvthyjeqov8.rcgu.o" "/home/admin/aur/shortwave-git/src/build/target/debug/deps/shortwave-e139f764d70b23e4.1xmksfiad8b55xuf.rcgu.o" "/home/admin/aur/shortwave-git/src/build/target/debug/deps/shortwave-e139f764d70b23e4.1y05grl13nre252f.rcgu.o" "/home/admin/aur/shortwave-git/src/build/target/debug/deps/shortwave-e139f764d70b23e4.1zt4ehffqcht0vpi.rcgu.o" "/home/admin/aur/shortwave-git/src/build/target/debug/deps/shortwave-e139f764d70b23e4.20e1emnjm27alekb.rcgu.o" "/home/admin/aur/shortwave-git/src/build/target/debug/deps/shortwave-e139f764d70b23e4.22gnplxqxwy8ow22.rcgu.o" "/home/admin/aur/shortwave-git/src/build/target/debug/deps/shortwave-e139f764d70b23e4.232gorzyqbmk5hc.rcgu.o" "/home/admin/aur/shortwave-git/src/build/target/debug/deps/shortwave-e139f764d70b23e4.244vmzynw4xwtf5x.rcgu.o" "/home/admin/aur/shortwave-git/src/build/target/debug/deps/shortwave-e139f764d70b23e4.24bcahafy9pt92kf.rcgu.o" "/home/admin/aur/shortwave-git/src/build/target/debug/deps/shortwave-e139f764d70b23e4.24vvxop49cgsm3qh.rcgu.o" "/home/admin/aur/shortwave-git/src/build/target/debug/deps/shortwave-e139f764d70b23e4.25mi3ca97oplk44m.rcgu.o" "/home/admin/aur/shortwave-git/src/build/target/debug/deps/shortwave-e139f764d70b23e4.25vtv3535ou99v42.rcgu.o" "/home/admin/aur/shortwave-git/src/build/target/debug/deps/shortwave-e139f764d70b23e4.26ourvso3kwidd9e.rcgu.o" "/home/admin/aur/shortwave-git/src/build/target/debug/deps/shortwave-e139f764d70b23e4.26rd65dr61i32f3y.rcgu.o" "/home/admin/aur/shortwave-git/src/build/target/debug/deps/shortwave-e139f764d70b23e4.26rrybub6e08mbci.rcgu.o" "/home/admin/aur/shortwave-git/src/build/target/debug/deps/shortwave-e139f764d70b23e4.27egbnqfbxupc5ca.rcgu.o" "/home/admin/aur/shortwave-git/src/build/target/debug/deps/shortwave-e139f764d70b23e4.27kyf61vlzkp892w.rcgu.o" "/home/admin/aur/shortwave-git/src/build/target/debug/deps/shortwave-e139f764d70b23e4.2c1w3a20cdj27u9a.rcgu.o" "/home/admin/aur/shortwave-git/src/build/target/debug/deps/shortwave-e139f764d70b23e4.2de4kcbr70wxjuha.rcgu.o" "/home/admin/aur/shortwave-git/src/build/target/debug/deps/shortwave-e139f764d70b23e4.2e8g5qm31x4hz259.rcgu.o" "/home/admin/aur/shortwave-git/src/build/target/debug/deps/shortwave-e139f764d70b23e4.2fd7inc4bkwjju8z.rcgu.o" "/home/admin/aur/shortwave-git/src/build/target/debug/deps/shortwave-e139f764d70b23e4.2g3qrhy0av38tv6y.rcgu.o" "/home/admin/aur/shortwave-git/src/build/target/debug/deps/shortwave-e139f764d70b23e4.2goypi0stdwlhna3.rcgu.o" "/home/admin/aur/shortwave-git/src/build/target/debug/deps/shortwave-e139f764d70b23e4.2hm2ovejfnqaituh.rcgu.o" "/home/admin/aur/shortwave-git/src/build/target/debug/deps/shortwave-e139f764d70b23e4.2i8insji7r8ywkma.rcgu.o" "/home/admin/aur/shortwave-git/src/build/target/debug/deps/shortwave-e139f764d70b23e4.2i9eyg2ee3sk2gtn.rcgu.o" "/home/admin/aur/shortwave-git/src/build/target/debug/deps/shortwave-e139f764d70b23e4.2je5ggyjjjsfg8jt.rcgu.o" "/home/admin/aur/shortwave-git/src/build/target/debug/deps/shortwave-e139f764d70b23e4.2jioaectykthz6lv.rcgu.o" "/home/admin/aur/shortwave-git/src/build/target/debug/deps/shortwave-e139f764d70b23e4.2krmzf8j2fwxomcv.rcgu.o" "/home/admin/aur/shortwave-git/src/build/target/debug/deps/shortwave-e139f764d70b23e4.2ll1h2aykh4xpokn.rcgu.o" "/home/admin/aur/shortwave-git/src/build/target/debug/deps/shortwave-e139f764d70b23e4.2lzpvu44sx5dmutr.rcgu.o" "/home/admin/aur/shortwave-git/src/build/target/debug/deps/shortwave-e139f764d70b23e4.2mj740r4xlrib6vm.rcgu.o" "/home/admin/aur/shortwave-git/src/build/target/debug/deps/shortwave-e139f764d70b23e4.2o6khvnqy06c4k5o.rcgu.o" "/home/admin/aur/shortwave-git/src/build/target/debug/deps/shortwave-e139f764d70b23e4.2p4ni7o9cx7u893x.rcgu.o" "/home/admin/aur/shortwave-git/src/build/target/debug/deps/shortwave-e139f764d70b23e4.2q02hhpl2srsjt3z.rcgu.o" "/home/admin/aur/shortwave-git/src/build/target/debug/deps/shortwave-e139f764d70b23e4.2qc7e3q9l50d20tv.rcgu.o" "/home/admin/aur/shortwave-git/src/build/target/debug/deps/shortwave-e139f764d70b23e4.2qsgpn4havlwkcjg.rcgu.o" "/home/admin/aur/shortwave-git/src/build/target/debug/deps/shortwave-e139f764d70b23e4.2t07u0mrkmd9zcot.rcgu.o" "/home/admin/aur/shortwave-git/src/build/target/debug/deps/shortwave-e139f764d70b23e4.2t79dyi743tk02j1.rcgu.o" "/home/admin/aur/shortwave-git/src/build/target/debug/deps/shortwave-e139f764d70b23e4.2to1dof3oufyr64m.rcgu.o" "/home/admin/aur/shortwave-git/src/build/target/debug/deps/shortwave-e139f764d70b23e4.2vepfrr6m7mg5o38.rcgu.o" "/home/admin/aur/shortwave-git/src/build/target/debug/deps/shortwave-e139f764d70b23e4.2w8jbhughv8gvbly.rcgu.o" "/home/admin/aur/shortwave-git/src/build/target/debug/deps/shortwave-e139f764d70b23e4.2wc9qi89qhtssol7.rcgu.o" "/home/admin/aur/shortwave-git/src/build/target/debug/deps/shortwave-e139f764d70b23e4.2xtxv1xdd6mnpydj.rcgu.o" "/home/admin/aur/shortwave-git/src/build/target/debug/deps/shortwave-e139f764d70b23e4.2z65vq0rd0hejcfu.rcgu.o" "/home/admin/aur/shortwave-git/src/build/target/debug/deps/shortwave-e139f764d70b23e4.308akwexlybknlbj.rcgu.o" "/home/admin/aur/shortwave-git/src/build/target/debug/deps/shortwave-e139f764d70b23e4.32le5mkthqgooxze.rcgu.o" "/home/admin/aur/shortwave-git/src/build/target/debug/deps/shortwave-e139f764d70b23e4.334dc4uu2rmtdrpt.rcgu.o" "/home/admin/aur/shortwave-git/src/build/target/debug/deps/shortwave-e139f764d70b23e4.341l0svp6l9ir91h.rcgu.o" "/home/admin/aur/shortwave-git/src/build/target/debug/deps/shortwave-e139f764d70b23e4.34t73nqsc6wsgb5m.rcgu.o" "/home/admin/aur/shortwave-git/src/build/target/debug/deps/shortwave-e139f764d70b23e4.350t4vc89brpgbb2.rcgu.o" "/home/admin/aur/shortwave-git/src/build/target/debug/deps/shortwave-e139f764d70b23e4.35yvm8rjs2zous3m.rcgu.o" "/home/admin/aur/shortwave-git/src/build/target/debug/deps/shortwave-e139f764d70b23e4.36u6ciry9hlhxchz.rcgu.o" "/home/admin/aur/shortwave-git/src/build/target/debug/deps/shortwave-e139f764d70b23e4.36zh43mkb3310xzc.rcgu.o" "/home/admin/aur/shortwave-git/src/build/target/debug/deps/shortwave-e139f764d70b23e4.37owy9rjf26s160q.rcgu.o" "/home/admin/aur/shortwave-git/src/build/target/debug/deps/shortwave-e139f764d70b23e4.38d1fo49sq1ch7gp.rcgu.o" "/home/admin/aur/shortwave-git/src/build/target/debug/deps/shortwave-e139f764d70b23e4.398aaa6kna9dt0gw.rcgu.o" "/home/admin/aur/shortwave-git/src/build/target/debug/deps/shortwave-e139f764d70b23e4.39n375o3o1u1fanu.rcgu.o" "/home/admin/aur/shortwave-git/src/build/target/debug/deps/shortwave-e139f764d70b23e4.3alu4r5sdkst5qug.rcgu.o" "/home/admin/aur/shortwave-git/src/build/target/debug/deps/shortwave-e139f764d70b23e4.3b2ok7yzjs1532hm.rcgu.o" "/home/admin/aur/shortwave-git/src/build/target/debug/deps/shortwave-e139f764d70b23e4.3cfm7yyla4p4t8nm.rcgu.o" "/home/admin/aur/shortwave-git/src/build/target/debug/deps/shortwave-e139f764d70b23e4.3cizaad4gx1hwkcf.rcgu.o" "/home/admin/aur/shortwave-git/src/build/target/debug/deps/shortwave-e139f764d70b23e4.3cqmic9quyyo1vq0.rcgu.o" "/home/admin/aur/shortwave-git/src/build/target/debug/deps/shortwave-e139f764d70b23e4.3ddw2uayxtebxrhl.rcgu.o" "/home/admin/aur/shortwave-git/src/build/target/debug/deps/shortwave-e139f764d70b23e4.3e33hhqo1myone67.rcgu.o" "/home/admin/aur/shortwave-git/src/build/target/debug/deps/shortwave-e139f764d70b23e4.3e4zbzc3tuv0igpi.rcgu.o" "/home/admin/aur/shortwave-git/src/build/target/debug/deps/shortwave-e139f764d70b23e4.3e6v16njbzxuvgtn.rcgu.o" "/home/admin/aur/shortwave-git/src/build/target/debug/deps/shortwave-e139f764d70b23e4.3h9mubrps3c1wwu4.rcgu.o" "/home/admin/aur/shortwave-git/src/build/target/debug/deps/shortwave-e139f764d70b23e4.3hg34m95u55j8mv0.rcgu.o" "/home/admin/aur/shortwave-git/src/build/target/debug/deps/shortwave-e139f764d70b23e4.3j15sb8bel8o6lib.rcgu.o" "/home/admin/aur/shortwave-git/src/build/target/debug/deps/shortwave-e139f764d70b23e4.3jrnghftbjhy5c73.rcgu.o" "/home/admin/aur/shortwave-git/src/build/target/debug/deps/shortwave-e139f764d70b23e4.3kxdswkwa8j9t4x1.rcgu.o" "/home/admin/aur/shortwave-git/src/build/target/debug/deps/shortwave-e139f764d70b23e4.3n14f1k25ntbnyxg.rcgu.o" "/home/admin/aur/shortwave-git/src/build/target/debug/deps/shortwave-e139f764d70b23e4.3ozmv7g1g3ujfb1x.rcgu.o" "/home/admin/aur/shortwave-git/src/build/target/debug/deps/shortwave-e139f764d70b23e4.3r7jwj0gf6b4dmz3.rcgu.o" "/home/admin/aur/shortwave-git/src/build/target/debug/deps/shortwave-e139f764d70b23e4.3roh195xl41qa3k0.rcgu.o" "/home/admin/aur/shortwave-git/src/build/target/debug/deps/shortwave-e139f764d70b23e4.3rwm9opkwwilol0c.rcgu.o" "/home/admin/aur/shortwave-git/src/build/target/debug/deps/shortwave-e139f764d70b23e4.3spj3yvu5lxpgaqe.rcgu.o" "/home/admin/aur/shortwave-git/src/build/target/debug/deps/shortwave-e139f764d70b23e4.3t1so5sgw5fjq4wi.rcgu.o" "/home/admin/aur/shortwave-git/src/build/target/debug/deps/shortwave-e139f764d70b23e4.3u5aam2nx6r34fbq.rcgu.o" "/home/admin/aur/shortwave-git/src/build/target/debug/deps/shortwave-e139f764d70b23e4.3u8x2bko5jdojxro.rcgu.o" "/home/admin/aur/shortwave-git/src/build/target/debug/deps/shortwave-e139f764d70b23e4.3uiugkcn1qr06879.rcgu.o" "/home/admin/aur/shortwave-git/src/build/target/debug/deps/shortwave-e139f764d70b23e4.3up2rdr3m2kkb001.rcgu.o" "/home/admin/aur/shortwave-git/src/build/target/debug/deps/shortwave-e139f764d70b23e4.3vv7avvsaljqwidr.rcgu.o" "/home/admin/aur/shortwave-git/src/build/target/debug/deps/shortwave-e139f764d70b23e4.3yn971chomix55a1.rcgu.o" "/home/admin/aur/shortwave-git/src/build/target/debug/deps/shortwave-e139f764d70b23e4.3zmhb6ldfbkqpdb3.rcgu.o" "/home/admin/aur/shortwave-git/src/build/target/debug/deps/shortwave-e139f764d70b23e4.400w8ls8s4940hkp.rcgu.o" "/home/admin/aur/shortwave-git/src/build/target/debug/deps/shortwave-e139f764d70b23e4.406t5i4st8scqu44.rcgu.o" "/home/admin/aur/shortwave-git/src/build/target/debug/deps/shortwave-e139f764d70b23e4.4086fdpjhx2b5xn0.rcgu.o" "/home/admin/aur/shortwave-git/src/build/target/debug/deps/shortwave-e139f764d70b23e4.41950zfsmj1wiqeb.rcgu.o" "/home/admin/aur/shortwave-git/src/build/target/debug/deps/shortwave-e139f764d70b23e4.41jxhdkzri4ynzlk.rcgu.o" "/home/admin/aur/shortwave-git/src/build/target/debug/deps/shortwave-e139f764d70b23e4.41ruzezffse30ub.rcgu.o" "/home/admin/aur/shortwave-git/src/build/target/debug/deps/shortwave-e139f764d70b23e4.42iu7d35ijdpit35.rcgu.o" "/home/admin/aur/shortwave-git/src/build/target/debug/deps/shortwave-e139f764d70b23e4.430chiwr33h4hv25.rcgu.o" "/home/admin/aur/shortwave-git/src/build/target/debug/deps/shortwave-e139f764d70b23e4.43lbpeoxs3g34dsp.rcgu.o" "/home/admin/aur/shortwave-git/src/build/target/debug/deps/shortwave-e139f764d70b23e4.43vwt1v1qf79udoi.rcgu.o" "/home/admin/aur/shortwave-git/src/build/target/debug/deps/shortwave-e139f764d70b23e4.44290hjgew2hrb5y.rcgu.o" "/home/admin/aur/shortwave-git/src/build/target/debug/deps/shortwave-e139f764d70b23e4.44ljgj1gwco828ke.rcgu.o" "/home/admin/aur/shortwave-git/src/build/target/debug/deps/shortwave-e139f764d70b23e4.45e5yljddktiviyn.rcgu.o" "/home/admin/aur/shortwave-git/src/build/target/debug/deps/shortwave-e139f764d70b23e4.474onx8n2wv1vb41.rcgu.o" "/home/admin/aur/shortwave-git/src/build/target/debug/deps/shortwave-e139f764d70b23e4.47bqeg5d7f67flmh.rcgu.o" "/home/admin/aur/shortwave-git/src/build/target/debug/deps/shortwave-e139f764d70b23e4.47ytlpr2uxbpctl1.rcgu.o" "/home/admin/aur/shortwave-git/src/build/target/debug/deps/shortwave-e139f764d70b23e4.48au406av5z2dnqa.rcgu.o" "/home/admin/aur/shortwave-git/src/build/target/debug/deps/shortwave-e139f764d70b23e4.48pwa3f6a2yo7yy0.rcgu.o" "/home/admin/aur/shortwave-git/src/build/target/debug/deps/shortwave-e139f764d70b23e4.4a3xpg4lz1a4f22s.rcgu.o" "/home/admin/aur/shortwave-git/src/build/target/debug/deps/shortwave-e139f764d70b23e4.4anc72b7a12p2ias.rcgu.o" "/home/admin/aur/shortwave-git/src/build/target/debug/deps/shortwave-e139f764d70b23e4.4b5kbj2wmypqsbcw.rcgu.o" "/home/admin/aur/shortwave-git/src/build/target/debug/deps/shortwave-e139f764d70b23e4.4beuychxm7j6vgyi.rcgu.o" "/home/admin/aur/shortwave-git/src/build/target/debug/deps/shortwave-e139f764d70b23e4.4beyxh51zi2ggplz.rcgu.o" "/home/admin/aur/shortwave-git/src/build/target/debug/deps/shortwave-e139f764d70b23e4.4bh4lv07mcuczxku.rcgu.o" "/home/admin/aur/shortwave-git/src/build/target/debug/deps/shortwave-e139f764d70b23e4.4cd6agb2f28o762l.rcgu.o" "/home/admin/aur/shortwave-git/src/build/target/debug/deps/shortwave-e139f764d70b23e4.4cef6gxzag6v3iec.rcgu.o" "/home/admin/aur/shortwave-git/src/build/target/debug/deps/shortwave-e139f764d70b23e4.4e0av5ds7tagcar7.rcgu.o" "/home/admin/aur/shortwave-git/src/build/target/debug/deps/shortwave-e139f764d70b23e4.4ec7dq9jjp18hbja.rcgu.o" "/home/admin/aur/shortwave-git/src/build/target/debug/deps/shortwave-e139f764d70b23e4.4f2u4k7ibr84189x.rcgu.o" "/home/admin/aur/shortwave-git/src/build/target/debug/deps/shortwave-e139f764d70b23e4.4fy4kimu1qjkzial.rcgu.o" "/home/admin/aur/shortwave-git/src/build/target/debug/deps/shortwave-e139f764d70b23e4.4ghaoce42zhj5syg.rcgu.o" "/home/admin/aur/shortwave-git/src/build/target/debug/deps/shortwave-e139f764d70b23e4.4h93y9h5cq1hq7r6.rcgu.o" "/home/admin/aur/shortwave-git/src/build/target/debug/deps/shortwave-e139f764d70b23e4.4jlfb6bw8utti1xx.rcgu.o" "/home/admin/aur/shortwave-git/src/build/target/debug/deps/shortwave-e139f764d70b23e4.4jv82smf4lqh4jk7.rcgu.o" "/home/admin/aur/shortwave-git/src/build/target/debug/deps/shortwave-e139f764d70b23e4.4k7zezm3ur05j6q8.rcgu.o" "/home/admin/aur/shortwave-git/src/build/target/debug/deps/shortwave-e139f764d70b23e4.4kjznzzn14jcsmp5.rcgu.o" "/home/admin/aur/shortwave-git/src/build/target/debug/deps/shortwave-e139f764d70b23e4.4l3l7lysuweeced4.rcgu.o" "/home/admin/aur/shortwave-git/src/build/target/debug/deps/shortwave-e139f764d70b23e4.4ltj7a8agrwmdc6h.rcgu.o" "/home/admin/aur/shortwave-git/src/build/target/debug/deps/shortwave-e139f764d70b23e4.4mk4rlzfj3czg2xs.rcgu.o" "/home/admin/aur/shortwave-git/src/build/target/debug/deps/shortwave-e139f764d70b23e4.4patx2ddfy6jn49w.rcgu.o" "/home/admin/aur/shortwave-git/src/build/target/debug/deps/shortwave-e139f764d70b23e4.4pco22gqrsaa7i46.rcgu.o" "/home/admin/aur/shortwave-git/src/build/target/debug/deps/shortwave-e139f764d70b23e4.4piskaupy23g47qk.rcgu.o" "/home/admin/aur/shortwave-git/src/build/target/debug/deps/shortwave-e139f764d70b23e4.4qv5pj2ket2ltfg5.rcgu.o" "/home/admin/aur/shortwave-git/src/build/target/debug/deps/shortwave-e139f764d70b23e4.4s38agtu6ekipeyq.rcgu.o" "/home/admin/aur/shortwave-git/src/build/target/debug/deps/shortwave-e139f764d70b23e4.4sefiozd57bifuwu.rcgu.o" "/home/admin/aur/shortwave-git/src/build/target/debug/deps/shortwave-e139f764d70b23e4.4ureuok7ad5ja1cu.rcgu.o" "/home/admin/aur/shortwave-git/src/build/target/debug/deps/shortwave-e139f764d70b23e4.4uuujlapgzx41wum.rcgu.o" "/home/admin/aur/shortwave-git/src/build/target/debug/deps/shortwave-e139f764d70b23e4.4uw8dfhbilf5ssd8.rcgu.o" "/home/admin/aur/shortwave-git/src/build/target/debug/deps/shortwave-e139f764d70b23e4.4wdw7kqwatdvnbxg.rcgu.o" "/home/admin/aur/shortwave-git/src/build/target/debug/deps/shortwave-e139f764d70b23e4.4wyhald018s072tb.rcgu.o" "/home/admin/aur/shortwave-git/src/build/target/debug/deps/shortwave-e139f764d70b23e4.4xrms6o5ujxxg64r.rcgu.o" "/home/admin/aur/shortwave-git/src/build/target/debug/deps/shortwave-e139f764d70b23e4.50dzrjo9evirfjj.rcgu.o" "/home/admin/aur/shortwave-git/src/build/target/debug/deps/shortwave-e139f764d70b23e4.516nwxe7e9k1imxb.rcgu.o" "/home/admin/aur/shortwave-git/src/build/target/debug/deps/shortwave-e139f764d70b23e4.53229rr4bepnqgr3.rcgu.o" "/home/admin/aur/shortwave-git/src/build/target/debug/deps/shortwave-e139f764d70b23e4.53r8evbrtoqw2ky9.rcgu.o" "/home/admin/aur/shortwave-git/src/build/target/debug/deps/shortwave-e139f764d70b23e4.55bnwe7j92c5jmkk.rcgu.o" "/home/admin/aur/shortwave-git/src/build/target/debug/deps/shortwave-e139f764d70b23e4.55im3zyymplrmxb5.rcgu.o" "/home/admin/aur/shortwave-git/src/build/target/debug/deps/shortwave-e139f764d70b23e4.55msnonfplrjnpjp.rcgu.o" "/home/admin/aur/shortwave-git/src/build/target/debug/deps/shortwave-e139f764d70b23e4.56hpb8b67wf48gop.rcgu.o" "/home/admin/aur/shortwave-git/src/build/target/debug/deps/shortwave-e139f764d70b23e4.57jcndloli4iqjl1.rcgu.o" "/home/admin/aur/shortwave-git/src/build/target/debug/deps/shortwave-e139f764d70b23e4.59ts9rl9r4wyjtp2.rcgu.o" "/home/admin/aur/shortwave-git/src/build/target/debug/deps/shortwave-e139f764d70b23e4.59ykt77r5t5at26h.rcgu.o" "/home/admin/aur/shortwave-git/src/build/target/debug/deps/shortwave-e139f764d70b23e4.5abvysedxns0631l.rcgu.o" "/home/admin/aur/shortwave-git/src/build/target/debug/deps/shortwave-e139f764d70b23e4.5b1lwgi4d4bu895v.rcgu.o" "/home/admin/aur/shortwave-git/src/build/target/debug/deps/shortwave-e139f764d70b23e4.5b4omnzksis2rrqe.rcgu.o" "/home/admin/aur/shortwave-git/src/build/target/debug/deps/shortwave-e139f764d70b23e4.5bmqc0oy6imom7vu.rcgu.o" "/home/admin/aur/shortwave-git/src/build/target/debug/deps/shortwave-e139f764d70b23e4.5bprjublz1rou91s.rcgu.o" "/home/admin/aur/shortwave-git/src/build/target/debug/deps/shortwave-e139f764d70b23e4.5c0k13cd9rfxulpq.rcgu.o" "/home/admin/aur/shortwave-git/src/build/target/debug/deps/shortwave-e139f764d70b23e4.5djiwtwh7x2bar9g.rcgu.o" "/home/admin/aur/shortwave-git/src/build/target/debug/deps/shortwave-e139f764d70b23e4.5e5iqpwhed7ocs9z.rcgu.o" "/home/admin/aur/shortwave-git/src/build/target/debug/deps/shortwave-e139f764d70b23e4.5faywwvn9v09oooh.rcgu.o" "/home/admin/aur/shortwave-git/src/build/target/debug/deps/shortwave-e139f764d70b23e4.5ff68c6i42jmyzue.rcgu.o" "/home/admin/aur/shortwave-git/src/build/target/debug/deps/shortwave-e139f764d70b23e4.5fjrnw2lvxe7zlm3.rcgu.o" "/home/admin/aur/shortwave-git/src/build/target/debug/deps/shortwave-e139f764d70b23e4.5fu4wk07ptauaop3.rcgu.o" "/home/admin/aur/shortwave-git/src/build/target/debug/deps/shortwave-e139f764d70b23e4.5g2yadga7r0x5qfh.rcgu.o" "/home/admin/aur/shortwave-git/src/build/target/debug/deps/shortwave-e139f764d70b23e4.5g9fir93a9mebnp0.rcgu.o" "/home/admin/aur/shortwave-git/src/build/target/debug/deps/shortwave-e139f764d70b23e4.5gld3jnlc8kcyx9z.rcgu.o" "/home/admin/aur/shortwave-git/src/build/target/debug/deps/shortwave-e139f764d70b23e4.638yf05z43dqf79.rcgu.o" "/home/admin/aur/shortwave-git/src/build/target/debug/deps/shortwave-e139f764d70b23e4.66coxype146d9di.rcgu.o" "/home/admin/aur/shortwave-git/src/build/target/debug/deps/shortwave-e139f764d70b23e4.723n10pcdb62lrk.rcgu.o" "/home/admin/aur/shortwave-git/src/build/target/debug/deps/shortwave-e139f764d70b23e4.75ytwjx30p4dpcs.rcgu.o" "/home/admin/aur/shortwave-git/src/build/target/debug/deps/shortwave-e139f764d70b23e4.7f7ytpabq6h2s6r.rcgu.o" "/home/admin/aur/shortwave-git/src/build/target/debug/deps/shortwave-e139f764d70b23e4.88p48kg3zqaf9gy.rcgu.o" "/home/admin/aur/shortwave-git/src/build/target/debug/deps/shortwave-e139f764d70b23e4.89r0rxj6or0ngw0.rcgu.o" "/home/admin/aur/shortwave-git/src/build/target/debug/deps/shortwave-e139f764d70b23e4.8a0kwydkz47353h.rcgu.o" "/home/admin/aur/shortwave-git/src/build/target/debug/deps/shortwave-e139f764d70b23e4.9cczv0qtqmvd8ft.rcgu.o" "/home/admin/aur/shortwave-git/src/build/target/debug/deps/shortwave-e139f764d70b23e4.a69k3wsah8h4s6.rcgu.o" "/home/admin/aur/shortwave-git/src/build/target/debug/deps/shortwave-e139f764d70b23e4.a9wa9twlp6gmsea.rcgu.o" "/home/admin/aur/shortwave-git/src/build/target/debug/deps/shortwave-e139f764d70b23e4.b3r2uv74xo49o6o.rcgu.o" "/home/admin/aur/shortwave-git/src/build/target/debug/deps/shortwave-e139f764d70b23e4.bc8l2yqq6trlk07.rcgu.o" "/home/admin/aur/shortwave-git/src/build/target/debug/deps/shortwave-e139f764d70b23e4.cuto78avfytqrdn.rcgu.o" "/home/admin/aur/shortwave-git/src/build/target/debug/deps/shortwave-e139f764d70b23e4.cv7wbar008b5dq6.rcgu.o" "/home/admin/aur/shortwave-git/src/build/target/debug/deps/shortwave-e139f764d70b23e4.cxdvhu2hcnu4mcr.rcgu.o" "/home/admin/aur/shortwave-git/src/build/target/debug/deps/shortwave-e139f764d70b23e4.czx8jgppm9z1ekz.rcgu.o" "/home/admin/aur/shortwave-git/src/build/target/debug/deps/shortwave-e139f764d70b23e4.d42vn0vmihs0jdx.rcgu.o" "/home/admin/aur/shortwave-git/src/build/target/debug/deps/shortwave-e139f764d70b23e4.dgx3biicpabh6dg.rcgu.o" "/home/admin/aur/shortwave-git/src/build/target/debug/deps/shortwave-e139f764d70b23e4.egr91ie9rchn4c.rcgu.o" "/home/admin/aur/shortwave-git/src/build/target/debug/deps/shortwave-e139f764d70b23e4.ejxmk8sd72ghpru.rcgu.o" "/home/admin/aur/shortwave-git/src/build/target/debug/deps/shortwave-e139f764d70b23e4.f6mv4v4f2ywwuzq.rcgu.o" "/home/admin/aur/shortwave-git/src/build/target/debug/deps/shortwave-e139f764d70b23e4.fgi5dgcf74m7kog.rcgu.o" "/home/admin/aur/shortwave-git/src/build/target/debug/deps/shortwave-e139f764d70b23e4.kbq6ekjuypywke8.rcgu.o" "/home/admin/aur/shortwave-git/src/build/target/debug/deps/shortwave-e139f764d70b23e4.ke6enybnpimgywe.rcgu.o" "/home/admin/aur/shortwave-git/src/build/target/debug/deps/shortwave-e139f764d70b23e4.lwpi5ex50u9omq6.rcgu.o" "/home/admin/aur/shortwave-git/src/build/target/debug/deps/shortwave-e139f764d70b23e4.mzonigwdbmk0jru.rcgu.o" "/home/admin/aur/shortwave-git/src/build/target/debug/deps/shortwave-e139f764d70b23e4.oir75r8unprsp0t.rcgu.o" "/home/admin/aur/shortwave-git/src/build/target/debug/deps/shortwave-e139f764d70b23e4.pska2d8asidhl6h.rcgu.o" "/home/admin/aur/shortwave-git/src/build/target/debug/deps/shortwave-e139f764d70b23e4.pxo228v90zborh1.rcgu.o" "/home/admin/aur/shortwave-git/src/build/target/debug/deps/shortwave-e139f764d70b23e4.q8pplqh9tq8ufu4.rcgu.o" "/home/admin/aur/shortwave-git/src/build/target/debug/deps/shortwave-e139f764d70b23e4.qelyxsa6oqiwvmk.rcgu.o" "/home/admin/aur/shortwave-git/src/build/target/debug/deps/shortwave-e139f764d70b23e4.rtmuupi5pxex4e4.rcgu.o" "/home/admin/aur/shortwave-git/src/build/target/debug/deps/shortwave-e139f764d70b23e4.stu9bam3wca6zez.rcgu.o" "/home/admin/aur/shortwave-git/src/build/target/debug/deps/shortwave-e139f764d70b23e4.sy1r4c6xv5tizbx.rcgu.o" "/home/admin/aur/shortwave-git/src/build/target/debug/deps/shortwave-e139f764d70b23e4.t37zq4ejvtv4pwc.rcgu.o" "/home/admin/aur/shortwave-git/src/build/target/debug/deps/shortwave-e139f764d70b23e4.tfe0bbumc7omm3c.rcgu.o" "/home/admin/aur/shortwave-git/src/build/target/debug/deps/shortwave-e139f764d70b23e4.tt7f5ei0s2j9ams.rcgu.o" "/home/admin/aur/shortwave-git/src/build/target/debug/deps/shortwave-e139f764d70b23e4.vlhvsz9z8oof9v3.rcgu.o" "/home/admin/aur/shortwave-git/src/build/target/debug/deps/shortwave-e139f764d70b23e4.wkkj9gb5xji21zw.rcgu.o" "/home/admin/aur/shortwave-git/src/build/target/debug/deps/shortwave-e139f764d70b23e4.xsafhbin74x80v7.rcgu.o" "/home/admin/aur/shortwave-git/src/build/target/debug/deps/shortwave-e139f764d70b23e4.xt08ynmz1yorwqx.rcgu.o" "/home/admin/aur/shortwave-git/src/build/target/debug/deps/shortwave-e139f764d70b23e4.zb7cpumioi8lm9w.rcgu.o" "/home/admin/aur/shortwave-git/src/build/target/debug/deps/shortwave-e139f764d70b23e4.h90l54as87treqs.rcgu.o" "-Wl,--as-needed" "-L" "/home/admin/aur/shortwave-git/src/build/target/debug/deps" "-L" "/home/admin/aur/shortwave-git/src/build/target/debug/build/curl-sys-13d37bd77190fff5/out/build" "-L" "/home/admin/aur/shortwave-git/src/build/target/debug/build/libnghttp2-sys-89b76247d8be3fb6/out/i/lib" "-L" "/usr/lib" "-L" "/usr/lib64/rustlib/x86_64-unknown-linux-gnu/lib" "-Wl,-Bstatic" "/home/admin/aur/shortwave-git/src/build/target/debug/deps/libopen-e579a70d9b61540e.rlib" "/home/admin/aur/shortwave-git/src/build/target/debug/deps/libpathdiff-569484a10c3f6c99.rlib" "/home/admin/aur/shortwave-git/src/build/target/debug/deps/libstrum-f9bd3160372c2c3f.rlib" "/home/admin/aur/shortwave-git/src/build/target/debug/deps/libsanitize_filename-a77d5cebd822d6de.rlib" "/home/admin/aur/shortwave-git/src/build/target/debug/deps/libserde_urlencoded-e9a179d9428b6331.rlib" "/home/admin/aur/shortwave-git/src/build/target/debug/deps/liblibshumate-83d51a77c5e29f4b.rlib" "/home/admin/aur/shortwave-git/src/build/target/debug/deps/liblibshumate_sys-3a2884e3c9b3a092.rlib" "/home/admin/aur/shortwave-git/src/build/target/debug/deps/libchrono-b306c4283aada8c4.rlib" "/home/admin/aur/shortwave-git/src/build/target/debug/deps/libtime-e0490f1def8d023e.rlib" "/home/admin/aur/shortwave-git/src/build/target/debug/deps/liblibadwaita-9de3ecd2412e5051.rlib" "/home/admin/aur/shortwave-git/src/build/target/debug/deps/liblibadwaita_sys-73a699e91f0d5af1.rlib" "/home/admin/aur/shortwave-git/src/build/target/debug/deps/libfutures-63f1dd53dd666409.rlib" "/home/admin/aur/shortwave-git/src/build/target/debug/deps/libmdns-d36290815821719a.rlib" "/home/admin/aur/shortwave-git/src/build/target/debug/deps/liberror_chain-666edb9ec3a533f3.rlib" "/home/admin/aur/shortwave-git/src/build/target/debug/deps/libbacktrace-7215f21b694d0c08.rlib" "/home/admin/aur/shortwave-git/src/build/target/debug/deps/libminiz_oxide-850c426af17f1903.rlib" "/home/admin/aur/shortwave-git/src/build/target/debug/deps/libadler-051d40e726fad8f8.rlib" "/home/admin/aur/shortwave-git/src/build/target/debug/deps/libobject-70d44e6aa95eaffc.rlib" "/home/admin/aur/shortwave-git/src/build/target/debug/deps/libaddr2line-bd52f0bd0efe2b9e.rlib" "/home/admin/aur/shortwave-git/src/build/target/debug/deps/libgimli-bcff3fa2f71e2566.rlib" "/home/admin/aur/shortwave-git/src/build/target/debug/deps/librustc_demangle-ff24e439a26c8c57.rlib" "/home/admin/aur/shortwave-git/src/build/target/debug/deps/libget_if_addrs-cf9cfa0131d0bac4.rlib" "/home/admin/aur/shortwave-git/src/build/target/debug/deps/libc_linked_list-64dd3610794e0eac.rlib" "/home/admin/aur/shortwave-git/src/build/target/debug/deps/libdns_parser-7f1230fcc20bbc64.rlib" "/home/admin/aur/shortwave-git/src/build/target/debug/deps/libmio-e43840b0c0718dfe.rlib" "/home/admin/aur/shortwave-git/src/build/target/debug/deps/libiovec-ff3d7d864fe36924.rlib" "/home/admin/aur/shortwave-git/src/build/target/debug/deps/libnet2-3a1541c3fc3713ed.rlib" "/home/admin/aur/shortwave-git/src/build/target/debug/deps/libcfg_if-294e34b781127e25.rlib" "/home/admin/aur/shortwave-git/src/build/target/debug/deps/libmpris_player-db81be92dbefb020.rlib" "/home/admin/aur/shortwave-git/src/build/target/debug/deps/libglib-5dc88dda65108126.rlib" "/home/admin/aur/shortwave-git/src/build/target/debug/deps/libgobject_sys-fbad042c61db57f9.rlib" "/home/admin/aur/shortwave-git/src/build/target/debug/deps/libglib_sys-682e42e597f15b45.rlib" "/home/admin/aur/shortwave-git/src/build/target/debug/deps/libdbus-651067ccbd549818.rlib" "/home/admin/aur/shortwave-git/src/build/target/debug/deps/liblibdbus_sys-8244f7c13f3fe3b7.rlib" "/home/admin/aur/shortwave-git/src/build/target/debug/deps/librust_cast-66a8d81966a46c94.rlib" "/home/admin/aur/shortwave-git/src/build/target/debug/deps/libprotobuf-a1fd03fab72f5dc1.rlib" "/home/admin/aur/shortwave-git/src/build/target/debug/deps/libopenssl-7a22022f323cc0ed.rlib" "/home/admin/aur/shortwave-git/src/build/target/debug/deps/libforeign_types-66de5a6d3812dd94.rlib" "/home/admin/aur/shortwave-git/src/build/target/debug/deps/libforeign_types_shared-0ccb893d5c737d49.rlib" "/home/admin/aur/shortwave-git/src/build/target/debug/deps/libindexmap-ec25daf4fb5c66f0.rlib" "/home/admin/aur/shortwave-git/src/build/target/debug/deps/libhashbrown-c1c6851f0da71d28.rlib" "/home/admin/aur/shortwave-git/src/build/target/debug/deps/libgstreamer_audio-1fe53771f7045641.rlib" "/home/admin/aur/shortwave-git/src/build/target/debug/deps/libarray_init-8dc16c1d17861442.rlib" "/home/admin/aur/shortwave-git/src/build/target/debug/deps/libgstreamer_base-f699b000c5c2218a.rlib" "/home/admin/aur/shortwave-git/src/build/target/debug/deps/libgstreamer_audio_sys-0ccbe78807b230ca.rlib" "/home/admin/aur/shortwave-git/src/build/target/debug/deps/libgstreamer_base_sys-fffbefe381ada3a9.rlib" "/home/admin/aur/shortwave-git/src/build/target/debug/deps/libgstreamer-52d10d11b8cb2c6e.rlib" "/home/admin/aur/shortwave-git/src/build/target/debug/deps/libmuldiv-ac3a6ed6aab820b6.rlib" "/home/admin/aur/shortwave-git/src/build/target/debug/deps/libpretty_hex-5be4f70178c41aa8.rlib" "/home/admin/aur/shortwave-git/src/build/target/debug/deps/libnum_rational-6f2f70d3ac2c9f4f.rlib" "/home/admin/aur/shortwave-git/src/build/target/debug/deps/libnum_integer-4143d50478bb05f8.rlib" "/home/admin/aur/shortwave-git/src/build/target/debug/deps/libnum_traits-1fb1ba8aabe980f9.rlib" "/home/admin/aur/shortwave-git/src/build/target/debug/deps/libgstreamer_sys-2f28fba8f8bf0524.rlib" "/home/admin/aur/shortwave-git/src/build/target/debug/deps/libinflector-50ceb700cc6a57d7.rlib" "/home/admin/aur/shortwave-git/src/build/target/debug/deps/libgtk4-a1024cca173f3c73.rlib" "/home/admin/aur/shortwave-git/src/build/target/debug/deps/libgsk4-7c0b50fecfb61fee.rlib" "/home/admin/aur/shortwave-git/src/build/target/debug/deps/libgraphene-d32a1e8f54e14ec3.rlib" "/home/admin/aur/shortwave-git/src/build/target/debug/deps/libgdk4-c428eb8871d12362.rlib" "/home/admin/aur/shortwave-git/src/build/target/debug/deps/libpango-dce72d74cb1ad92f.rlib" "/home/admin/aur/shortwave-git/src/build/target/debug/deps/libgdk_pixbuf-c193c218f0b9b0fd.rlib" "/home/admin/aur/shortwave-git/src/build/target/debug/deps/libgio-478252f815d13cee.rlib" "/home/admin/aur/shortwave-git/src/build/target/debug/deps/libcairo-1aa90d714c59c3e7.rlib" "/home/admin/aur/shortwave-git/src/build/target/debug/deps/libglib-ddad10da50d6c71b.rlib" "/home/admin/aur/shortwave-git/src/build/target/debug/deps/libfutures_executor-fe0caab2ad8babd1.rlib" "/home/admin/aur/shortwave-git/src/build/target/debug/deps/libbitflags-b4ebf0a021913702.rlib" "/home/admin/aur/shortwave-git/src/build/target/debug/deps/libgtk4_sys-8f230cbb6ad3123e.rlib" "/home/admin/aur/shortwave-git/src/build/target/debug/deps/libgsk4_sys-a413b536e375c94e.rlib" "/home/admin/aur/shortwave-git/src/build/target/debug/deps/libgraphene_sys-75198b23f07ac245.rlib" "/home/admin/aur/shortwave-git/src/build/target/debug/deps/libgdk4_sys-692ce7e1b56cde96.rlib" "/home/admin/aur/shortwave-git/src/build/target/debug/deps/libpango_sys-de1a159e912def38.rlib" "/home/admin/aur/shortwave-git/src/build/target/debug/deps/libgdk_pixbuf_sys-82612ce03fda197c.rlib" "/home/admin/aur/shortwave-git/src/build/target/debug/deps/libgio_sys-34348c9a20a63300.rlib" "/home/admin/aur/shortwave-git/src/build/target/debug/deps/libgobject_sys-54d6ef56fbb09f3f.rlib" "/home/admin/aur/shortwave-git/src/build/target/debug/deps/libcairo_sys-a98fff27e9297af0.rlib" "/home/admin/aur/shortwave-git/src/build/target/debug/deps/libglib_sys-08a3a87d455a147d.rlib" "/home/admin/aur/shortwave-git/src/build/target/debug/deps/libfield_offset-c58879aab736c50e.rlib" "/home/admin/aur/shortwave-git/src/build/target/debug/deps/libmemoffset-08f6128ba0dbec14.rlib" "/home/admin/aur/shortwave-git/src/build/target/debug/deps/libisahc-1f91f3aebacc66a2.rlib" "/home/admin/aur/shortwave-git/src/build/target/debug/deps/libmime-82ad03130a970a91.rlib" "/home/admin/aur/shortwave-git/src/build/target/debug/deps/libserde_json-3eef921614c2e705.rlib" "/home/admin/aur/shortwave-git/src/build/target/debug/deps/libryu-12c2f7d09ca886ea.rlib" "/home/admin/aur/shortwave-git/src/build/target/debug/deps/libserde-c7648f69d15f1908.rlib" "/home/admin/aur/shortwave-git/src/build/target/debug/deps/libencoding_rs-980f8bb228d2b247.rlib" "/home/admin/aur/shortwave-git/src/build/target/debug/deps/libtracing_futures-3a4e65307c155f7a.rlib" "/home/admin/aur/shortwave-git/src/build/target/debug/deps/libtracing-3aa236f732ee767f.rlib" "/home/admin/aur/shortwave-git/src/build/target/debug/deps/libtracing_core-d11655dfd8111518.rlib" "/home/admin/aur/shortwave-git/src/build/target/debug/deps/libpin_project-cab224bcdf29d097.rlib" "/home/admin/aur/shortwave-git/src/build/target/debug/deps/libhttp-f111e99c9f8ac5cb.rlib" "/home/admin/aur/shortwave-git/src/build/target/debug/deps/libitoa-c5185870fcdebe35.rlib" "/home/admin/aur/shortwave-git/src/build/target/debug/deps/libbytes-4bd18f06a415f819.rlib" "/home/admin/aur/shortwave-git/src/build/target/debug/deps/libfnv-92025c091e8f5a77.rlib" "/home/admin/aur/shortwave-git/src/build/target/debug/deps/libsluice-b9e347aaa759c4c9.rlib" "/home/admin/aur/shortwave-git/src/build/target/debug/deps/libcurl-5c8f36237e2de367.rlib" "/home/admin/aur/shortwave-git/src/build/target/debug/deps/libopenssl_probe-980bf59dc29eeb98.rlib" "/home/admin/aur/shortwave-git/src/build/target/debug/deps/libcurl_sys-246e49b215614472.rlib" "/home/admin/aur/shortwave-git/src/build/target/debug/deps/libopenssl_sys-2a10256ac93aa9ad.rlib" "/home/admin/aur/shortwave-git/src/build/target/debug/deps/liblibz_sys-f43dabc5ea286f26.rlib" "/home/admin/aur/shortwave-git/src/build/target/debug/deps/liblibnghttp2_sys-349405cf50dba7d4.rlib" "/home/admin/aur/shortwave-git/src/build/target/debug/deps/libcrossbeam_utils-bf51a17106ac0f69.rlib" "/home/admin/aur/shortwave-git/src/build/target/debug/deps/libasync_std_resolver-31072d55305c2703.rlib" "/home/admin/aur/shortwave-git/src/build/target/debug/deps/libasync_std-858a3d6b56abd231.rlib" "/home/admin/aur/shortwave-git/src/build/target/debug/deps/libasync_global_executor-9df936c09ecb7a77.rlib" "/home/admin/aur/shortwave-git/src/build/target/debug/deps/libblocking-4f1e4531c413588d.rlib" "/home/admin/aur/shortwave-git/src/build/target/debug/deps/libatomic_waker-a1c8a4b16e98e4d2.rlib" "/home/admin/aur/shortwave-git/src/build/target/debug/deps/libnum_cpus-ab8aec9f0684c668.rlib" "/home/admin/aur/shortwave-git/src/build/target/debug/deps/libasync_mutex-00334214a2904621.rlib" "/home/admin/aur/shortwave-git/src/build/target/debug/deps/libasync_executor-56d91550e6edce2c.rlib" "/home/admin/aur/shortwave-git/src/build/target/debug/deps/libasync_task-510459bd6d9cb79a.rlib" "/home/admin/aur/shortwave-git/src/build/target/debug/deps/libasync_io-fbd97f169ac2f07b.rlib" "/home/admin/aur/shortwave-git/src/build/target/debug/deps/libpolling-ae5265ddb39ad2f2.rlib" "/home/admin/aur/shortwave-git/src/build/target/debug/deps/libonce_cell-789385cbef9686ee.rlib" "/home/admin/aur/shortwave-git/src/build/target/debug/deps/libsocket2-6afa93dfe5974b4a.rlib" "/home/admin/aur/shortwave-git/src/build/target/debug/deps/libfutures_lite-5aa6dcb3c6f43032.rlib" "/home/admin/aur/shortwave-git/src/build/target/debug/deps/libfastrand-a339e8072fb59828.rlib" "/home/admin/aur/shortwave-git/src/build/target/debug/deps/libwaker_fn-3645a463eb138b5f.rlib" "/home/admin/aur/shortwave-git/src/build/target/debug/deps/libparking-0db3e59c9cbe3194.rlib" "/home/admin/aur/shortwave-git/src/build/target/debug/deps/libasync_channel-d2981a611a887018.rlib" "/home/admin/aur/shortwave-git/src/build/target/debug/deps/libconcurrent_queue-39acf2ef4adcc740.rlib" "/home/admin/aur/shortwave-git/src/build/target/debug/deps/libcache_padded-b06ff2becbdfd864.rlib" "/home/admin/aur/shortwave-git/src/build/target/debug/deps/libasync_lock-f2b19ab14b93e709.rlib" "/home/admin/aur/shortwave-git/src/build/target/debug/deps/libevent_listener-40875d206c93eb37.rlib" "/home/admin/aur/shortwave-git/src/build/target/debug/deps/libkv_log_macro-53c11cba307b0f92.rlib" "/home/admin/aur/shortwave-git/src/build/target/debug/deps/libtrust_dns_resolver-50df2d55a6ed882a.rlib" "/home/admin/aur/shortwave-git/src/build/target/debug/deps/libresolv_conf-19324cbf5b9c8445.rlib" "/home/admin/aur/shortwave-git/src/build/target/debug/deps/libhostname-b567bf6234f2807f.rlib" "/home/admin/aur/shortwave-git/src/build/target/debug/deps/libmatch_cfg-d80b769c8225080a.rlib" "/home/admin/aur/shortwave-git/src/build/target/debug/deps/liblru_cache-471ce85c4aa99e31.rlib" "/home/admin/aur/shortwave-git/src/build/target/debug/deps/liblinked_hash_map-cf806fcee94e22c9.rlib" "/home/admin/aur/shortwave-git/src/build/target/debug/deps/libtrust_dns_proto-6acfdc6d92c58fd7.rlib" "/home/admin/aur/shortwave-git/src/build/target/debug/deps/librand-eb512cb9298354fd.rlib" "/home/admin/aur/shortwave-git/src/build/target/debug/deps/librand_chacha-51eb58adc18ef0cb.rlib" "/home/admin/aur/shortwave-git/src/build/target/debug/deps/libppv_lite86-d26f9a0ea47f4928.rlib" "/home/admin/aur/shortwave-git/src/build/target/debug/deps/librand_core-ca4d210b0b39bb3a.rlib" "/home/admin/aur/shortwave-git/src/build/target/debug/deps/libgetrandom-2bb3dd1ab695eac1.rlib" "/home/admin/aur/shortwave-git/src/build/target/debug/deps/libdata_encoding-68e3a000f7084867.rlib" "/home/admin/aur/shortwave-git/src/build/target/debug/deps/liburl-2b698dd85dc67284.rlib" "/home/admin/aur/shortwave-git/src/build/target/debug/deps/libform_urlencoded-fb0bb890db3f4a60.rlib" "/home/admin/aur/shortwave-git/src/build/target/debug/deps/libpercent_encoding-73615c49e9b5a5ab.rlib" "/home/admin/aur/shortwave-git/src/build/target/debug/deps/libipnet-4e5a7826472c0d0e.rlib" "/home/admin/aur/shortwave-git/src/build/target/debug/deps/libidna-bb4044cea14ef0ad.rlib" "/home/admin/aur/shortwave-git/src/build/target/debug/deps/libunicode_normalization-0adcaf894c49e0da.rlib" "/home/admin/aur/shortwave-git/src/build/target/debug/deps/libunicode_bidi-5c5cb03da2c07e51.rlib" "/home/admin/aur/shortwave-git/src/build/target/debug/deps/libmatches-11bf2dcbdc262200.rlib" "/home/admin/aur/shortwave-git/src/build/target/debug/deps/libtinyvec-f812be2b51716451.rlib" "/home/admin/aur/shortwave-git/src/build/target/debug/deps/libtinyvec_macros-6828a1fc799590eb.rlib" "/home/admin/aur/shortwave-git/src/build/target/debug/deps/libthiserror-ede518a57bc52496.rlib" "/home/admin/aur/shortwave-git/src/build/target/debug/deps/libfutures_util-ad63c2420cf2c8ba.rlib" "/home/admin/aur/shortwave-git/src/build/target/debug/deps/libfutures_io-979da2196df6df52.rlib" "/home/admin/aur/shortwave-git/src/build/target/debug/deps/libslab-fd3e1535b7a40804.rlib" "/home/admin/aur/shortwave-git/src/build/target/debug/deps/libfutures_channel-c2e41a97d1c7eb8b.rlib" "/home/admin/aur/shortwave-git/src/build/target/debug/deps/libpin_project_lite-fcd933a51dad0d6f.rlib" "/home/admin/aur/shortwave-git/src/build/target/debug/deps/libfutures_sink-96f769e3b7be34a3.rlib" "/home/admin/aur/shortwave-git/src/build/target/debug/deps/libfutures_task-6b9568206e968844.rlib" "/home/admin/aur/shortwave-git/src/build/target/debug/deps/libpin_utils-a53ae7115d243a86.rlib" "/home/admin/aur/shortwave-git/src/build/target/debug/deps/libfutures_core-ae1e0eb8aa723b47.rlib" "/home/admin/aur/shortwave-git/src/build/target/debug/deps/libgettextrs-70f4476a38788db3.rlib" "/home/admin/aur/shortwave-git/src/build/target/debug/deps/libgettext_sys-31a4334490779070.rlib" "/home/admin/aur/shortwave-git/src/build/target/debug/deps/liblocale_config-cdffa8db79e4a681.rlib" "/home/admin/aur/shortwave-git/src/build/target/debug/deps/liblazy_static-309107f5d628485a.rlib" "/home/admin/aur/shortwave-git/src/build/target/debug/deps/libgtk_macros-f41fabcfa15bb4b5.rlib" "/home/admin/aur/shortwave-git/src/build/target/debug/deps/libdiesel_migrations-3d7989b0ad68ab01.rlib" "/home/admin/aur/shortwave-git/src/build/target/debug/deps/libmigrations_internals-f5148e45365f2e0f.rlib" "/home/admin/aur/shortwave-git/src/build/target/debug/deps/libdiesel-a64ca5bcc1f32fd7.rlib" "/home/admin/aur/shortwave-git/src/build/target/debug/deps/liblibsqlite3_sys-d648da8073b8ab63.rlib" "/home/admin/aur/shortwave-git/src/build/target/debug/deps/libr2d2-29971102b9fafa85.rlib" "/home/admin/aur/shortwave-git/src/build/target/debug/deps/libscheduled_thread_pool-de2f53942e3640c0.rlib" "/home/admin/aur/shortwave-git/src/build/target/debug/deps/libparking_lot-29028bccb791543d.rlib" "/home/admin/aur/shortwave-git/src/build/target/debug/deps/libparking_lot_core-58fb6a47d2b8962f.rlib" "/home/admin/aur/shortwave-git/src/build/target/debug/deps/libsmallvec-da241ab8668cbcf9.rlib" "/home/admin/aur/shortwave-git/src/build/target/debug/deps/liblock_api-8f3c228baaed07b6.rlib" "/home/admin/aur/shortwave-git/src/build/target/debug/deps/libscopeguard-377e25aaf46b040e.rlib" "/home/admin/aur/shortwave-git/src/build/target/debug/deps/libinstant-7dc3aaa993bb6f1b.rlib" "/home/admin/aur/shortwave-git/src/build/target/debug/deps/libbyteorder-73f2d3cc8c2714fe.rlib" "/home/admin/aur/shortwave-git/src/build/target/debug/deps/libpretty_env_logger-080be7f50cd36051.rlib" "/home/admin/aur/shortwave-git/src/build/target/debug/deps/libenv_logger-da013541d8ffe64b.rlib" "/home/admin/aur/shortwave-git/src/build/target/debug/deps/libtermcolor-8f5fe58fdb9129f4.rlib" "/home/admin/aur/shortwave-git/src/build/target/debug/deps/libatty-897caea4bf3f049a.rlib" "/home/admin/aur/shortwave-git/src/build/target/debug/deps/liblibc-65c62de3d6d2db03.rlib" "/home/admin/aur/shortwave-git/src/build/target/debug/deps/libhumantime-fb21913baa7821b1.rlib" "/home/admin/aur/shortwave-git/src/build/target/debug/deps/libquick_error-67769033d1a59609.rlib" "/home/admin/aur/shortwave-git/src/build/target/debug/deps/libregex-2b11b6e87d40d1a4.rlib" "/home/admin/aur/shortwave-git/src/build/target/debug/deps/libaho_corasick-8f58439ddbfb87ff.rlib" "/home/admin/aur/shortwave-git/src/build/target/debug/deps/libmemchr-5b4452208338e52e.rlib" "/home/admin/aur/shortwave-git/src/build/target/debug/deps/libregex_syntax-1da0d954d1c76876.rlib" "/home/admin/aur/shortwave-git/src/build/target/debug/deps/liblog-f64cd6cba129e70f.rlib" "/home/admin/aur/shortwave-git/src/build/target/debug/deps/libvalue_bag-241789662812443d.rlib" "/home/admin/aur/shortwave-git/src/build/target/debug/deps/libcfg_if-274948e23cb92afb.rlib" "-Wl,--start-group" "/usr/lib/rustlib/x86_64-unknown-linux-gnu/lib/libstd-6a87599ccdd508aa.rlib" "/usr/lib/rustlib/x86_64-unknown-linux-gnu/lib/libpanic_unwind-4281a2c6df17d23d.rlib" "/usr/lib/rustlib/x86_64-unknown-linux-gnu/lib/libminiz_oxide-b49ab9cddf0d60c2.rlib" "/usr/lib/rustlib/x86_64-unknown-linux-gnu/lib/libadler-d73d2fb13953b047.rlib" "/usr/lib/rustlib/x86_64-unknown-linux-gnu/lib/libobject-b3401c7766749926.rlib" "/usr/lib/rustlib/x86_64-unknown-linux-gnu/lib/libmemchr-12e49f00df3e8ca5.rlib" "/usr/lib/rustlib/x86_64-unknown-linux-gnu/lib/libaddr2line-04889e12337e5a3a.rlib" "/usr/lib/rustlib/x86_64-unknown-linux-gnu/lib/libgimli-25066f77720ae540.rlib" "/usr/lib/rustlib/x86_64-unknown-linux-gnu/lib/libstd_detect-a5184c173f8d1041.rlib" "/usr/lib/rustlib/x86_64-unknown-linux-gnu/lib/librustc_demangle-c9fc7b198102b9c2.rlib" "/usr/lib/rustlib/x86_64-unknown-linux-gnu/lib/libhashbrown-260faa82b6eba687.rlib" "/usr/lib/rustlib/x86_64-unknown-linux-gnu/lib/librustc_std_workspace_alloc-156c8ba612906ba6.rlib" "/usr/lib/rustlib/x86_64-unknown-linux-gnu/lib/libunwind-f8415c1f46a9c7d3.rlib" "/usr/lib/rustlib/x86_64-unknown-linux-gnu/lib/libcfg_if-d4acabe6e826d12d.rlib" "/usr/lib/rustlib/x86_64-unknown-linux-gnu/lib/liblibc-852f93e5fc9fd77c.rlib" "/usr/lib/rustlib/x86_64-unknown-linux-gnu/lib/liballoc-9b07841a64c80402.rlib" "/usr/lib/rustlib/x86_64-unknown-linux-gnu/lib/librustc_std_workspace_core-c0d37dbe0ac5b63c.rlib" "/usr/lib/rustlib/x86_64-unknown-linux-gnu/lib/libcore-184cb0d3dc8d82d8.rlib" "-Wl,--end-group" "/usr/lib/rustlib/x86_64-unknown-linux-gnu/lib/libcompiler_builtins-daba8545161e9335.rlib" "-Wl,-Bdynamic" "-lshumate-0.0" "-lgtk-4" "-lpangocairo-1.0" "-lpango-1.0" "-lharfbuzz" "-lgdk_pixbuf-2.0" "-lcairo-gobject" "-lcairo" "-lgraphene-1.0" "-lgio-2.0" "-lgobject-2.0" "-lglib-2.0" "-ladwaita-1" "-lgtk-4" "-lpangocairo-1.0" "-lpango-1.0" "-lharfbuzz" "-lgdk_pixbuf-2.0" "-lcairo-gobject" "-lcairo" "-lgraphene-1.0" "-lgio-2.0" "-lgobject-2.0" "-lglib-2.0" "-lgobject-2.0" "-lglib-2.0" "-ldbus-1" "-lgstaudio-1.0" "-lgstbase-1.0" "-lgsttag-1.0" "-lgstreamer-1.0" "-lgobject-2.0" "-lglib-2.0" "-lgstbase-1.0" "-lgstreamer-1.0" "-lgobject-2.0" "-lglib-2.0" "-lgstreamer-1.0" "-lgobject-2.0" "-lglib-2.0" "-lgobject-2.0" "-lgtk-4" "-lpangocairo-1.0" "-lpango-1.0" "-lharfbuzz" "-lgdk_pixbuf-2.0" "-lcairo-gobject" "-lcairo" "-lgraphene-1.0" "-lgio-2.0" "-lgobject-2.0" "-lglib-2.0" "-lgtk-4" "-lpangocairo-1.0" "-lpango-1.0" "-lharfbuzz" "-lgdk_pixbuf-2.0" "-lcairo-gobject" "-lcairo" "-lgraphene-1.0" "-lgio-2.0" "-lgobject-2.0" "-lglib-2.0" "-lgraphene-1.0" "-lgobject-2.0" "-lglib-2.0" "-lgtk-4" "-lpangocairo-1.0" "-lpango-1.0" "-lharfbuzz" "-lgdk_pixbuf-2.0" "-lcairo-gobject" "-lcairo" "-lgraphene-1.0" "-lgio-2.0" "-lgobject-2.0" "-lglib-2.0" "-lpango-1.0" "-lgobject-2.0" "-lglib-2.0" "-lharfbuzz" "-lgdk_pixbuf-2.0" "-lgobject-2.0" "-lglib-2.0" "-lgio-2.0" "-lgobject-2.0" "-lglib-2.0" "-lgobject-2.0" "-lglib-2.0" "-lcairo-gobject" "-lcairo" "-lgobject-2.0" "-lglib-2.0" "-lgobject-2.0" "-lglib-2.0" "-lssl" "-lcrypto" "-lz" "-lsqlite3" "-lgcc_s" "-lutil" "-lrt" "-lpthread" "-lm" "-ldl" "-lc" "-Wl,--eh-frame-hdr" "-Wl,-znoexecstack" "-L" "/usr/lib64/rustlib/x86_64-unknown-linux-gnu/lib" "-o" "/home/admin/aur/shortwave-git/src/build/target/debug/deps/shortwave-e139f764d70b23e4" "-Wl,--gc-sections" "-pie" "-Wl,-zrelro" "-Wl,-znow" "-nodefaultlibs"
  = note: /usr/bin/ld: /home/admin/aur/shortwave-git/src/build/target/debug/deps/shortwave-e139f764d70b23e4.55im3zyymplrmxb5.rcgu.o: in function `libshumate::auto::license::License::append_map_source':
      /home/admin/aur/shortwave-git/src/build/cargo-home/git/checkouts/libshumate-rs-6a6234d7a249c05a/973216f/libshumate/src/auto/license.rs:46: undefined reference to `shumate_license_append_map_source'
      collect2: error: ld returned 1 exit status

  = help: some `extern` functions couldn't be found; some native libraries may need to be installed or have their path specified
  = note: use the `-l` flag to specify native libraries to link
  = note: use the `cargo:rustc-link-lib` directive to specify the native libraries to link with Cargo (see https://doc.rust-lang.org/cargo/reference/build-scripts.html#cargorustc-link-libkindname)

error: could not compile `shortwave` due to previous error
FAILED: src/shortwave 
/home/admin/aur/shortwave-git/src/Shortwave/build-aux/cargo.sh /home/admin/aur/shortwave-git/src/build /home/admin/aur/shortwave-git/src/Shortwave src/shortwave /usr/share/locale development
ninja: build stopped: subcommand failed.
==> ERROR: A failure occurred in build().
    Aborting...

yochananmarqos commented on 2021-08-06 21:05 (UTC)

@dreieck: I can't reproduce that. Make sure you have the rust package installed, not rustup.

dreieck commented on 2021-08-06 20:21 (UTC)

Fails to build for me with meson.build:1:0: ERROR: Unknown compiler(s): [['rustc']]:

+ exec meson setup --prefix /usr --libexecdir lib --sbindir bin --buildtype plain --auto-features enabled --wrap-mode nodownload -D b_lto=true -D b_pie=true shortwave build
The Meson build system
Version: 0.59.0
Source dir: /[...]/shortwave-git/src/shortwave
Build dir: /[...]/shortwave-git/src/build
Build type: native build
Project name: shortwave
Project version: 2.0.1

shortwave/meson.build:1:0: ERROR: Unknown compiler(s): [['rustc']]

A full log can be found at /[...]/shortwave-git/src/build/meson-logs/meson-log.txt

The /[...]/shortwave-git/src/build/meson-logs/meson-log.txt shows

Build started at 2021-08-06T22:19:37.024514
Main binary: /usr/bin/python
Build Options: -Db_lto=true -Db_pie=true -Dprefix=/usr -Dlibexecdir=lib -Dsbindir=bin -Dauto_features=enabled -Dbuildtype=plain -Dwrap_mode=nodownload
Python system: Linux
The Meson build system
Version: 0.59.0
Source dir: /[...]/shortwave-git/src/shortwave
Build dir: /[...]/shortwave-git/src/build
Build type: native build
Project name: shortwave
Project version: 2.0.1

shortwave/meson.build:1:0: ERROR: Unknown compiler(s): [['rustc']]

(The [...] denotes censoring I have made on general directory names.)

SolarAquarion commented on 2020-08-14 12:22 (UTC)

it needs libhandy1 now

Tio commented on 2020-03-23 14:01 (UTC)

Ah ok I see thank you!

yochananmarqos commented on 2020-03-23 03:10 (UTC)

@Tio: The latest version of curl will resolve the issue. You will have to wait for the next Manjaro stable update, switch to the testing or unstable branch or use Arch.

Remember, this is the Arch User Repository and other Arch-based spins are not supported by Arch and are usually taboo to mention.

Tio commented on 2020-03-23 02:46 (UTC)

I see....I use Manjaro Gnome and Pamac so you know. For me this git version and the non git one of shortwave get stuck with the same error

yochananmarqos commented on 2020-03-22 14:56 (UTC)

@Tio: I can't reproduce that error right now, however I have seen the "spurious network error" with crates.io lately.

Tio commented on 2020-03-22 13:56 (UTC)

Error:


Caused by:
  [28] Timeout was reached (download of `gtk v0.8.0` failed to transfer more than 10 bytes in 30s)
[3/4] Generating de.haeckerfelix.Shortwave.metainfo.xml_data_merge with a custom command.
FAILED: src/shortwave 
/var/tmp/pamac-build-tio/shortwave-git/src/Shortwave/build-aux/cargo.sh /var/tmp/pamac-build-tio/shortwave-git/src/build /var/tmp/pamac-build-tio/shortwave-git/src/Shortwave src/shortwave /usr/share/locale default
ninja: build stopped: subcommand failed.
==> ERROR: A failure occurred in build().
    Aborting...

yochananmarqos commented on 2019-12-22 15:39 (UTC)

@j1simon: Added.

j1simon commented on 2019-12-21 10:29 (UTC)

It lacks dependencies:

$ makepkg
....
   Compiling hyper v0.12.35
error: failed to run custom build command for `cairo-sys-rs v0.9.2`

Caused by:
  process didn't exit successfully: `/tmp/makepkg/shortwave-git/src/build/target/debug/build/cairo-sys-rs-bfa399f4b755b098/build-script-build` (exit code: 1)
--- stderr
`"pkg-config" "--libs" "--cflags" "cairo-gobject" "cairo-gobject >= 1.12"` did not exit successfully: exit code: 1
--- stdout


--- stderr
Package xproto was not found in the pkg-config search path.
Perhaps you should add the directory containing `xproto.pc'
to the PKG_CONFIG_PATH environment variable
Package 'xproto', required by 'xau', not found
Package 'xproto', required by 'xdmcp', not found
Package 'xproto', required by 'xau', not found
Package 'xproto', required by 'xdmcp', not found
Package 'xproto', required by 'xau', not found
Package 'xproto', required by 'xdmcp', not found
Package 'xproto', required by 'xrender', not found
Package 'renderproto', required by 'xrender', not found
Package 'xproto', required by 'x11', not found
Package 'kbproto', required by 'x11', not found
Package 'xproto', required by 'x11', not found
Package 'kbproto', required by 'x11', not found
Package 'xextproto', required by 'xext', not found
Package 'xproto', required by 'xau', not found
Package 'xproto', required by 'xdmcp', not found
Package 'xproto', required by 'xau', not found
Package 'xproto', required by 'xdmcp', not found
Package 'xproto', required by 'xau', not found
Package 'xproto', required by 'xdmcp', not found
Package 'xproto', required by 'xrender', not found
Package 'renderproto', required by 'xrender', not found
Package 'xproto', required by 'x11', not found
Package 'kbproto', required by 'x11', not found
Package 'xproto', required by 'x11', not found
Package 'kbproto', required by 'x11', not found
Package 'xextproto', required by 'xext', not found


warning: build failed, waiting for other jobs to finish...
error: build failed
[3/4] Generating de.haeckerfelix.Shortwave.appdata.xml_data_merge with a custom command.
FAILED: src/shortwave 
/tmp/makepkg/shortwave-git/src/Shortwave/build-aux/cargo.sh /tmp/makepkg/shortwave-git/src/build /tmp/makepkg/shortwave-git/src/Shortwave src/shortwave /usr/share/locale beta
ninja: build stopped: subcommand failed.
==> ERROR: A failure occurred in build().
    Aborting...

yochananmarqos commented on 2019-11-20 15:37 (UTC)

@r381581: It turns out you are absolutely correct. I removed it.

r381581 commented on 2019-11-20 12:15 (UTC)

Is there any reason for forcing the removal of Gradio with the installation of this package? I mean, okay it's a complete rewrite whose objective is to replace it, but it's 1/ A different software, with different name and different binaries and file ; 2/ still in early development and can lack features of Gradio or be way more buggy.

A user can want to have both on its computer to try this new one, help on dev and do bug reports while still having Gradio for regular use. Add a note to tell Gradio is deemed to be replaced, why not, but imho you shouldn't forbid Shortwave and Gradio to be both installed: they don't conflict with each other.

Tio commented on 2019-11-12 13:07 (UTC)

I see thanks. I was testing it on Manjaro Gnome Stable

coxackie commented on 2019-11-12 09:27 (UTC)

@ Tio: you have to use the latest version of rust (1.39), where async/await became stable. rustup update

Tio commented on 2019-11-12 01:56 (UTC) (edited on 2019-11-12 01:57 (UTC) by Tio)

Error:

error[E0658]: async fn is unstable
  --> src/api/client.rs:29:5
   |
29 | /     pub async fn send_station_request(self, request: StationRequest) -> Result<Vec<Station>, Error> {
30 | |         let url = self.build_url(STATION_SEARCH, Some(&request.url_encode()))?;
31 | |         debug!("Station request URL: {}", url);
32 | |         let data = self.send_message(url).await?;
...  |
38 | |         Ok(stations)
39 | |     }
   | |_____^
   |
   = note: for more information, see https://github.com/rust-lang/rust/issues/50547

error[E0658]: async/await is unstable
  --> src/api/client.rs:32:20
   |
32 |         let data = self.send_message(url).await?;
   |                    ^^^^^^^^^^^^^^^^^^^^^^^^^^^^
   |
   = note: for more information, see https://github.com/rust-lang/rust/issues/50547

error[E0658]: async fn is unstable
  --> src/api/client.rs:41:5
   |
41 | /     pub async fn get_stations_by_identifiers(self, identifiers: Vec<StationIdentifier>) -> Result<Vec<Station>, Error> {
42 | |         let mut stations = Vec::new();
43 | |
44 | |         for identifier in identifiers {
...  |
55 | |         Ok(stations)
56 | |     }
   | |_____^
   |
   = note: for more information, see https://github.com/rust-lang/rust/issues/50547

error[E0658]: async/await is unstable
  --> src/api/client.rs:47:24
   |
47 |             let data = self.send_message(url).await?;
   |                        ^^^^^^^^^^^^^^^^^^^^^^^^^^^^
   |
   = note: for more information, see https://github.com/rust-lang/rust/issues/50547

error[E0658]: async fn is unstable
  --> src/api/client.rs:58:5
   |
58 | /     pub async fn get_stream_url(self, station: Station) -> Result<StationUrl, Error> {
59 | |         let url = self.build_url(&format!("{}{}", PLAYABLE_STATION_URL, station.id), None)?;
60 | |         debug!("Request playable URL: {}", url);
61 | |         let data = self.send_message(url).await?;
...  |
66 | |         Ok(result[0].clone())
67 | |     }
   | |_____^
   |
   = note: for more information, see https://github.com/rust-lang/rust/issues/50547

error[E0658]: async/await is unstable
  --> src/api/client.rs:61:20
   |
61 |         let data = self.send_message(url).await?;
   |                    ^^^^^^^^^^^^^^^^^^^^^^^^^^^^
   |
   = note: for more information, see https://github.com/rust-lang/rust/issues/50547

error[E0658]: async fn is unstable
  --> src/api/client.rs:70:5
   |
70 | /     async fn send_message(&self, url: Url) -> std::result::Result<GString, Error> {
71 | |         // Create SOUP message
72 | |         match soup::Message::new("GET", &url.to_string()) {
73 | |             Some(message) => {
...  |
86 | |         }
87 | |     }
   | |_____^
   |
   = note: for more information, see https://github.com/rust-lang/rust/issues/50547

error[E0658]: async/await is unstable
  --> src/api/client.rs:75:36
   |
75 |                 let input_stream = self.session.send_async_future(&message).await?;
   |                                    ^^^^^^^^^^^^^^^^^^^^^^^^^^^^^^^^^^^^^^^^^^^^^^
   |
   = note: for more information, see https://github.com/rust-lang/rust/issues/50547

error[E0658]: async/await is unstable
  --> src/api/client.rs:80:30
   |
80 |                 let result = data_input_stream.read_upto_async_future("", glib::PRIORITY_LOW).await?;
   |                              ^^^^^^^^^^^^^^^^^^^^^^^^^^^^^^^^^^^^^^^^^^^^^^^^^^^^^^^^^^^^^^^^^^^^^^
   |
   = note: for more information, see https://github.com/rust-lang/rust/issues/50547

error[E0658]: async fn is unstable
  --> src/api/favicon_downloader.rs:33:5
   |
33 | /     pub async fn download(self, url: Url, size: i32) -> Result<Pixbuf, Error> {
34 | |         match self.get_cached_pixbuf(&url, &size).await {
35 | |             Ok(pixbuf) => return Ok(pixbuf),
36 | |             Err(_) => debug!("No cached favicon available for {:?}", url),
...  |
64 | |         Ok(self.get_cached_pixbuf(&url, &size).await?)
65 | |     }
   | |_____^
   |
   = note: for more information, see https://github.com/rust-lang/rust/issues/50547

error[E0658]: async/await is unstable
  --> src/api/favicon_downloader.rs:34:15
   |
34 |         match self.get_cached_pixbuf(&url, &size).await {
   |               ^^^^^^^^^^^^^^^^^^^^^^^^^^^^^^^^^^^^^^^^^
   |
   = note: for more information, see https://github.com/rust-lang/rust/issues/50547

error[E0658]: async/await is unstable
  --> src/api/favicon_downloader.rs:43:36
   |
43 |                 let input_stream = self.session.send_async_future(&message).await?;
   |                                    ^^^^^^^^^^^^^^^^^^^^^^^^^^^^^^^^^^^^^^^^^^^^^^
   |
   = note: for more information, see https://github.com/rust-lang/rust/issues/50547

error[E0658]: async/await is unstable
  --> src/api/favicon_downloader.rs:50:30
   |
50 |                 let pixbuf = Pixbuf::new_from_stream_at_scale_async_future(&data_input_stream, 192, 192, true).await?;
   |                              ^^^^^^^^^^^^^^^^^^^^^^^^^^^^^^^^^^^^^^^^^^^^^^^^^^^^^^^^^^^^^^^^^^^^^^^^^^^^^^^^^^^^^^^
   |
   = note: for more information, see https://github.com/rust-lang/rust/issues/50547

error[E0658]: async/await is unstable
  --> src/api/favicon_downloader.rs:55:31
   |
55 |                     let ios = file.create_readwrite_async_future(gio::FileCreateFlags::REPLACE_DESTINATION, glib::PRIORITY_DEFAULT).await?;
   |                               ^^^^^^^^^^^^^^^^^^^^^^^^^^^^^^^^^^^^^^^^^^^^^^^^^^^^^^^^^^^^^^^^^^^^^^^^^^^^^^^^^^^^^^^^^^^^^^^^^^^^^^^^^^^
   |
   = note: for more information, see https://github.com/rust-lang/rust/issues/50547

error[E0658]: async/await is unstable
  --> src/api/favicon_downloader.rs:57:21
   |
57 |                     pixbuf.save_to_streamv_async_future(&data_output_stream, "png", &[]).await?;
   |                     ^^^^^^^^^^^^^^^^^^^^^^^^^^^^^^^^^^^^^^^^^^^^^^^^^^^^^^^^^^^^^^^^^^^^^^^^^^
   |
   = note: for more information, see https://github.com/rust-lang/rust/issues/50547

error[E0658]: async/await is unstable
  --> src/api/favicon_downloader.rs:64:12
   |
64 |         Ok(self.get_cached_pixbuf(&url, &size).await?)
   |            ^^^^^^^^^^^^^^^^^^^^^^^^^^^^^^^^^^^^^^^^^
   |
   = note: for more information, see https://github.com/rust-lang/rust/issues/50547

error[E0658]: async fn is unstable
  --> src/api/favicon_downloader.rs:67:5
   |
67 | /     async fn get_cached_pixbuf(&self, url: &Url, size: &i32) -> Result<Pixbuf, Error> {
68 | |         let file = Self::get_file(&url)?;
69 | |         if Self::exists(&file) {
70 | |             let ios = file.open_readwrite_async_future(glib::PRIORITY_DEFAULT).await.expect("Could not open file");
...  |
76 | |         }
77 | |     }
   | |_____^
   |
   = note: for more information, see https://github.com/rust-lang/rust/issues/50547

error[E0658]: async/await is unstable
  --> src/api/favicon_downloader.rs:70:23
   |
70 |             let ios = file.open_readwrite_async_future(glib::PRIORITY_DEFAULT).await.expect("Could not open file");
   |                       ^^^^^^^^^^^^^^^^^^^^^^^^^^^^^^^^^^^^^^^^^^^^^^^^^^^^^^^^^^^^^^
   |
   = note: for more information, see https://github.com/rust-lang/rust/issues/50547

error[E0658]: async/await is unstable
  --> src/api/favicon_downloader.rs:73:16
   |
73 |             Ok(Pixbuf::new_from_stream_at_scale_async_future(&data_input_stream, *size, *size, true).await?)
   |                ^^^^^^^^^^^^^^^^^^^^^^^^^^^^^^^^^^^^^^^^^^^^^^^^^^^^^^^^^^^^^^^^^^^^^^^^^^^^^^^^^^^^^^^^^^^
   |
   = note: for more information, see https://github.com/rust-lang/rust/issues/50547

error: aborting due to 19 previous errors

For more information about this error, try `rustc --explain E0658`.
error: Could not compile `shortwave`.

To learn more, run the command again with --verbose.
[3/4] Generating de.haeckerfelix.Shortwave.appdata.xml_data_merge with a custom command.
FAILED: src/shortwave 
/var/tmp/pamac-build-tio/shortwave-git/src/Shortwave/build-aux/cargo.sh /var/tmp/pamac-build-tio/shortwave-git/src/build /var/tmp/pamac-build-tio/shortwave-git/src/Shortwave src/shortwave /usr/share/locale beta
ninja: build stopped: subcommand failed.
==> ERROR: A failure occurred in build().
    Aborting...

yochananmarqos commented on 2019-11-11 17:04 (UTC) (edited on 2019-11-11 17:05 (UTC) by yochananmarqos)

Tags are now available:

pkgver() {
    cd "$srcdir/Shortwave"
    printf "%s" "$(git describe --long | sed 's/\([^-]*-\)g/r\1/;s/-/./g')"
}
0.0.1.r0.cd80fc2

Also, appstream-glib is required to build:

Program appstream-util found: YES (/usr/sbin/appstream-util)

Listing both cargo and rust is redundant, just use one or the other. The project page specifies rust.

gradio should be added to provides() and conflicts().

flipflop97 commented on 2019-03-30 16:27 (UTC)

@nicoulaj

Thanks, added!

nicoulaj commented on 2019-03-29 19:49 (UTC) (edited on 2019-03-29 19:49 (UTC) by nicoulaj)

I think a makedepends on gst-plugins-base-libs is needed, this is what happens when building in a chroot:

Package gstreamer-audio-1.0 was not found in the pkg-config search path.
Perhaps you should add the directory containing `gstreamer-audio-1.0.pc'
to the PKG_CONFIG_PATH environment variable
Package 'gstreamer-audio-1.0', required by 'virtual:world', not found


warning: build failed, waiting for other jobs to finish...
error: failed to run custom build command for `gstreamer-video-sys v0.7.0`
process didn't exit successfully: `/build/shortwave-git/src/build/target/release/build/gstreamer-video-sys-287deda3e527dbee/build-script-bu
ild` (exit code: 1)

Tio commented on 2019-02-06 13:05 (UTC)

@flipflop97 I see thank you very much

flipflop97 commented on 2019-02-06 12:30 (UTC) (edited on 2019-02-06 12:31 (UTC) by flipflop97)

@teoretic

The same applies to your error as with @kouros17.

The last line of your error shows what's wrong:
libhandy 0.0.7 is needed while 0.0.6 is installed. Since the repo version is out of date you'll have to fall back and install libhandy-git for now.

Tio commented on 2019-02-05 14:18 (UTC)

I get this error on Manjaro Gnome:

Preparing... Cloning shortwave-git build files... Checking shortwave-git dependencies... Resolving dependencies... Checking inter-conflicts... Downloading libhandy (0.0.6-1-x86_64)... Checking keyring... Checking integrity... Loading packages files... Checking file conflicts... Checking available disk space... Installing libhandy (0.0.6-1)... Building shortwave-git... ==> Making package: shortwave-git r215.b28ab0d-1 (mar 05 feb 2019 15:11:18 CET) ==> Checking runtime dependencies... ==> Checking buildtime dependencies... ==> Retrieving sources... -> Cloning Shortwave git repo... Cloning into bare repository '/tmp/pamac-build/shortwave-git/Shortwave'... ==> Validating source files with sha256sums... Shortwave ... Skipped ==> Removing existing $srcdir/ directory... ==> Extracting sources... -> Creating working copy of Shortwave git repo... Cloning into 'Shortwave'... done. ==> Starting pkgver()... ==> Updated version: shortwave-git r218.6fd90a5-1 ==> Starting build()... + exec meson setup --prefix /usr --libdir /usr/lib --libexecdir /usr/lib --bindir /usr/bin --sbindir /usr/bin --includedir /usr/include --datadir /usr/share --mandir /usr/share/man --infodir /usr/share/info --localedir /usr/share/locale --sysconfdir /etc --localstatedir /var --sharedstatedir /var/lib --buildtype release --auto-features enabled --wrap-mode nofallback -D b_lto=true -D b_pie=true Shortwave build The Meson build system Version: 0.49.0 Source dir: /tmp/pamac-build/shortwave-git/src/Shortwave Build dir: /tmp/pamac-build/shortwave-git/src/build Build type: native build Project name: shortwave Project version: 7.99.0 Appending LDFLAGS from environment: '-Wl,-O1,--sort-common,--as-needed,-z,relro,-z,now' Native Rust compiler: rustc (rustc 1.32.0) Build machine cpu family: x86_64 Build machine cpu: x86_64 Configuring de.haeckerfelix.Shortwave.desktop.in using configuration Program desktop-file-validate found: YES (/usr/bin/desktop-file-validate) Configuring de.haeckerfelix.Shortwave.appdata.xml.in using configuration Program appstream-util found: YES (/usr/bin/appstream-util) Configuring de.haeckerfelix.Shortwave.service using configuration Program cargo found: YES (/usr/bin/cargo) Program glib-compile-resources found: YES (/usr/bin/glib-compile-resources) Program cargo-vendor found: NO Program build-aux/cargo.sh found: YES (/tmp/pamac-build/shortwave-git/src/Shortwave/build-aux/cargo.sh) Program build-aux/grabber.sh found: YES (/tmp/pamac-build/shortwave-git/src/Shortwave/build-aux/grabber.sh) Program build-aux/release.sh found: YES (/tmp/pamac-build/shortwave-git/src/Shortwave/build-aux/release.sh) WARNING: Custom target input '['src', 'src/window.rs', 'src/widgets', 'src/widgets/station_row.rs', 'src/widgets/station_listbox.rs', 'src/widgets/song_row.rs', 'src/widgets/song_listbox.rs', 'src/widgets/notification.rs', 'src/widgets/mod.rs', 'src/station_model.rs', 'src/static_resource.rs', 'src/song.rs', 'src/search.rs', 'src/player.rs', 'src/main.rs', 'src/library.rs', 'src/gstreamer_backend.rs', 'src/app.rs', 'src/widgets', 'src/widgets/station_row.rs', 'src/widgets/station_listbox.rs', 'src/widgets/song_row.rs', 'src/widgets/song_listbox.rs', 'src/widgets/notification.rs', 'src/widgets/mod.rs', 'data/gtk', 'data/gtk/window.ui', 'data/gtk/style.css', 'data/gtk/station_row.ui', 'data/gtk/station_listbox.ui', 'data/gtk/song_listbox.ui', 'data/gtk/shortcuts.ui', 'data/gtk/search.ui', 'data/gtk/recorder.ui', 'data/gtk/player.ui', 'data/gtk/notification.ui', 'data/gtk/menu.ui', 'data/gtk/library.ui', 'data', 'data/resources.xml', 'data/meson.build', 'data/icons', 'data/icons/meson.build', 'data/icons/hicolor', 'data/icons/hicolor/symbolic', 'data/icons/hicolor/symbolic/apps', 'data/icons/hicolor/symbolic/apps/de.haeckerfelix.Shortwave-symbolic.svg', 'data/icons/hicolor/scalable', 'data/icons/hicolor/scalable/apps', 'data/icons/hicolor/scalable/apps/de.haeckerfelix.Shortwave.svg', 'data/gtk', 'data/gtk/window.ui', 'data/gtk/style.css', 'data/gtk/station_row.ui', 'data/gtk/station_listbox.ui', 'data/gtk/song_listbox.ui', 'data/gtk/shortcuts.ui', 'data/gtk/search.ui', 'data/gtk/recorder.ui', 'data/gtk/player.ui', 'data/gtk/notification.ui', 'data/gtk/menu.ui', 'data/gtk/library.ui', 'data/de.haeckerfelix.Shortwave.service.in', 'data/de.haeckerfelix.Shortwave.gschema.xml', 'data/de.haeckerfelix.Shortwave.desktop.in.in', 'data/de.haeckerfelix.Shortwave.appdata.xml.in.in']' can't be converted to File object(s). This will become a hard error in the future. Program build-aux/meson_post_install.py found: YES (/tmp/pamac-build/shortwave-git/src/Shortwave/build-aux/meson_post_install.py) Build targets in project: 4 Found ninja-1.8.2 at /usr/bin/ninja ninja: Entering directory build' [0/3] Generating cargo-build with a custom command. RELEASE MODE Updating crates.io index Updating git repositoryhttps://gitlab.gnome.org/World/Rust/libhandy-rsUpdating git repositoryhttps://gitlab.gnome.org/haecker-felix/Rustio.gitDownloading crates ... Downloaded stopwatch v0.0.7 Downloaded uuid v0.7.2 Downloaded serde v1.0.87 Downloaded gstreamer v0.12.2 Downloaded libc v0.2.48 Downloaded gobject-sys v0.7.0 Downloaded log v0.4.6 Downloaded indexmap v1.0.2 Downloaded gdk-sys v0.7.0 Downloaded gio v0.5.1 Downloaded simplelog v0.5.3 Downloaded glib-sys v0.7.0 Downloaded rusqlite v0.13.0 Downloaded glib v0.6.1 Downloaded gtk v0.5.0 Downloaded gtk-sys v0.7.0 Downloaded bitflags v1.0.4 Downloaded gdk v0.9.0 Downloaded gstreamer-pbutils v0.12.2 Downloaded pkg-config v0.3.14 Downloaded serde_derive v1.0.87 Downloaded gio-sys v0.7.0 Downloaded quick-error v1.2.2 Downloaded lazy_static v1.2.0 Downloaded mpris-player v0.1.0 Downloaded restson v0.4.1 Downloaded cfg-if v0.1.6 Downloaded num v0.1.42 Downloaded lru-cache v0.1.1 Downloaded time v0.1.42 Downloaded chrono v0.4.6 Downloaded rand v0.6.5 Downloaded gstreamer-sys v0.6.2 Downloaded pango-sys v0.7.0 Downloaded cairo-rs v0.5.0 Downloaded muldiv v0.2.0 Downloaded syn v0.15.26 Downloaded gstreamer-pbutils-sys v0.6.2 Downloaded pango v0.5.0 Downloaded term v0.5.1 Downloaded gdk-pixbuf-sys v0.7.0 Downloaded atk-sys v0.7.0 Downloaded gdk-pixbuf v0.5.0 Downloaded proc-macro2 v0.4.27 Downloaded num-rational v0.2.1 Downloaded fragile v0.3.0 Downloaded cairo-sys-rs v0.7.0 Downloaded num-complex v0.1.43 Downloaded num-traits v0.2.6 Downloaded serde_json v1.0.38 Downloaded hyper v0.12.23 Downloaded rand_xorshift v0.1.1 Downloaded rand_os v0.1.2 Downloaded rand_core v0.4.0 Downloaded num-integer v0.1.39 Downloaded hyper-tls v0.3.1 Downloaded futures v0.1.25 Downloaded rand_hc v0.1.0 Downloaded dbus v0.6.4 Downloaded linked-hash-map v0.4.2 Downloaded gstreamer-audio-sys v0.6.2 Downloaded url v1.7.2 Downloaded rand_chacha v0.1.1 Downloaded byteorder v1.3.1 Downloaded num-rational v0.1.42 Downloaded rand_jitter v0.1.2 Downloaded rand_pcg v0.1.1 Downloaded base64 v0.10.1 Downloaded unicode-xid v0.1.0 Downloaded tokio-core v0.1.17 Downloaded rand_isaac v0.1.1 Downloaded autocfg v0.1.2 Downloaded quote v0.6.11 Downloaded num-iter v0.1.37 Downloaded tokio-io v0.1.11 Downloaded itoa v0.4.3 Downloaded tokio-executor v0.1.6 Downloaded tokio-threadpool v0.1.11 Downloaded iovec v0.1.2 Downloaded idna v0.1.5 Downloaded gstreamer-video-sys v0.6.2 Downloaded rustc_version v0.2.3 Downloaded rustc-serialize v0.3.24 Downloaded bytes v0.4.11 Downloaded http v0.1.15 Downloaded tokio v0.1.15 Downloaded httparse v1.3.3 Downloaded rand_core v0.3.1 Downloaded native-tls v0.2.2 Downloaded tokio-tcp v0.1.3 Downloaded mio v0.6.16 Downloaded gstreamer-base-sys v0.6.2 Downloaded futures-cpupool v0.1.8 Downloaded ryu v0.2.7 Downloaded percent-encoding v1.0.1 Downloaded h2 v0.1.16 Downloaded tokio-reactor v0.1.8 Downloaded tokio-timer v0.2.10 Downloaded scoped-tls v0.1.2 Downloaded matches v0.1.8 Downloaded num-bigint v0.1.44 Downloaded want v0.0.6 Downloaded net2 v0.2.33 Downloaded rand v0.4.6 Downloaded tokio-codec v0.1.1 Downloaded tokio-udp v0.1.3 Downloaded libdbus-sys v0.1.5 Downloaded slab v0.4.2 Downloaded parking_lot v0.7.1 Downloaded unicode-normalization v0.1.8 Downloaded openssl-sys v0.9.40 Downloaded lazycell v1.2.1 Downloaded crossbeam-deque v0.6.3 Downloaded string v0.1.3 Downloaded tokio-sync v0.1.1 Downloaded tokio-fs v0.1.5 Downloaded crossbeam-channel v0.3.8 Downloaded openssl v0.10.16 Downloaded crossbeam v0.6.0 Downloaded semver v0.9.0 Downloaded tokio-current-thread v0.1.4 Downloaded unicode-bidi v0.3.4 Downloaded openssl-probe v0.1.2 Downloaded tokio-uds v0.2.5 Downloaded fnv v1.0.6 Downloaded num_cpus v1.9.0 Downloaded crossbeam-utils v0.6.5 Downloaded mio-uds v0.6.7 Downloaded smallvec v0.6.8 Downloaded lock_api v0.1.5 Downloaded semver-parser v0.7.0 Downloaded cc v1.0.29 Downloaded libsqlite3-sys v0.9.3 Downloaded try-lock v0.2.2 Downloaded parking_lot_core v0.4.0 Downloaded scopeguard v0.3.3 Downloaded crossbeam-epoch v0.7.1 Downloaded owning_ref v0.4.0 Downloaded unreachable v1.0.0 Downloaded arrayvec v0.4.10 Downloaded memoffset v0.2.1 Downloaded stable_deref_trait v1.1.1 Downloaded void v1.0.2 Downloaded foreign-types v0.3.2 Downloaded foreign-types-shared v0.1.1 Downloaded nodrop v0.1.13 Compiling semver-parser v0.7.0 Compiling autocfg v0.1.2 Compiling libc v0.2.48 Compiling rand_core v0.4.0 Compiling void v1.0.2 Compiling arrayvec v0.4.10 Compiling lazy_static v1.2.0 Compiling cfg-if v0.1.6 Compiling byteorder v1.3.1 Compiling stable_deref_trait v1.1.1 Compiling nodrop v0.1.13 Compiling memoffset v0.2.1 Compiling pkg-config v0.3.14 Compiling scopeguard v0.3.3 Compiling lazycell v1.2.1 Compiling slab v0.4.2 Compiling cc v1.0.29 Compiling futures v0.1.25 Compiling num-traits v0.2.6 Compiling proc-macro2 v0.4.27 Compiling foreign-types-shared v0.1.1 Compiling fnv v1.0.6 Compiling httparse v1.3.3 Compiling itoa v0.4.3 Compiling gio v0.5.1 Compiling bitflags v1.0.4 Compiling num-integer v0.1.39 Compiling openssl v0.10.16 Compiling unicode-xid v0.1.0 Compiling gdk-pixbuf v0.5.0 Compiling indexmap v1.0.2 Compiling native-tls v0.2.2 Compiling string v0.1.3 Compiling ryu v0.2.7 Compiling fragile v0.3.0 Compiling matches v0.1.8 Compiling try-lock v0.2.2 Compiling serde v1.0.87 Compiling cairo-rs v0.5.0 Compiling num-iter v0.1.37 Compiling gdk v0.9.0 Compiling num-rational v0.2.1 Compiling rustc-serialize v0.3.24 Compiling openssl-probe v0.1.2 Compiling scoped-tls v0.1.2 Compiling gstreamer v0.12.2 Compiling gtk v0.5.0 Compiling percent-encoding v1.0.1 Compiling gstreamer-pbutils v0.12.2 Compiling linked-hash-map v0.4.2 Compiling muldiv v0.2.0 Compiling shortwave v0.1.0 (/tmp/pamac-build/shortwave-git/src/Shortwave) Compiling quick-error v1.2.2 Compiling log v0.4.6 Compiling unreachable v1.0.0 Compiling crossbeam-utils v0.6.5 Compiling owning_ref v0.4.0 Compiling rand_core v0.3.1 Compiling rand_jitter v0.1.2 Compiling rand_chacha v0.1.1 Compiling rand v0.6.5 Compiling semver v0.9.0 Compiling foreign-types v0.3.2 Compiling glib-sys v0.7.0 Compiling gobject-sys v0.7.0 Compiling gio-sys v0.7.0 Compiling gdk-pixbuf-sys v0.7.0 Compiling gstreamer-sys v0.6.2 Compiling cairo-sys-rs v0.7.0 Compiling pango-sys v0.7.0 Compiling gdk-sys v0.7.0 Compiling gstreamer-base-sys v0.6.2 Compiling atk-sys v0.7.0 Compiling gstreamer-audio-sys v0.6.2 Compiling gstreamer-video-sys v0.6.2 Compiling gtk-sys v0.7.0 Compiling libdbus-sys v0.1.5 Compiling libsqlite3-sys v0.9.3 Compiling gstreamer-pbutils-sys v0.6.2 Compiling libhandy-sys v0.2.0 (<https://gitlab.gnome.org/World/Rust/libhandy-rs#c63cc611>) Compiling unicode-bidi v0.3.4 Compiling tokio-sync v0.1.1 Compiling lru-cache v0.1.1 Compiling smallvec v0.6.8 Compiling rand_isaac v0.1.1 Compiling rand_xorshift v0.1.1 Compiling rand_hc v0.1.0 Compiling lock_api v0.1.5 Compiling want v0.0.6 Compiling tokio-executor v0.1.6 Compiling openssl-sys v0.9.40 Compiling rustc_version v0.2.3 Compiling crossbeam-channel v0.3.8 Compiling unicode-normalization v0.1.8 Compiling base64 v0.10.1 Compiling term v0.5.1 Compiling crossbeam-epoch v0.7.1 Compiling rand_os v0.1.2 Compiling iovec v0.1.2 Compiling num_cpus v1.9.0 Compiling net2 v0.2.33 Compiling time v0.1.42 Compiling rand v0.4.6 Compiling tokio-timer v0.2.10 Compiling tokio-current-thread v0.1.4 Compiling num-complex v0.1.43 Compiling rand_pcg v0.1.1 Compiling parking_lot_core v0.4.0 Compiling crossbeam-deque v0.6.3 Compiling quote v0.6.11 Compiling bytes v0.4.11 Compiling futures-cpupool v0.1.8 Compiling mio v0.6.16 Compiling dbus v0.6.4 Compiling rusqlite v0.13.0 Compiling num-bigint v0.1.44 Compiling chrono v0.4.6 Compiling serde_json v1.0.38 Compiling tokio-io v0.1.11 Compiling http v0.1.15 Compiling syn v0.15.26 Compiling glib v0.6.1 Compiling mio-uds v0.6.7 Compiling num-rational v0.1.42 Compiling simplelog v0.5.3 Compiling tokio-codec v0.1.1 Compiling idna v0.1.5 Compiling h2 v0.1.16 Compiling num v0.1.42 Compiling stopwatch v0.0.7 error: failed to run custom build command forlibhandy-sys v0.2.0 (https://gitlab.gnome.org/World/Rust/libhandy-rs#c63cc611)process didn't exit successfully:/tmp/pamac-build/shortwave-git/src/Shortwave/target/release/build/libhandy-sys-ff396523c0a0db4d/build-script-build(exit code: 1) --- stderr"pkg-config" "--libs" "--cflags" "libhandy-0.0 >= 0.0.7"` did not exit successfully: exit code: 1 --- stderr Package dependency requirement 'libhandy-0.0 >= 0.0.7' could not be satisfied. Package 'libhandy-0.0' has version '0.0.6', required version is '>= 0.0.7'

warning: build failed, waiting for other jobs to finish... error: build failed [2/3] Generating de.haeckerfelix.Shortwave.appdata.xml_data_merge with a custom command. FAILED: shortwave /tmp/pamac-build/shortwave-git/src/Shortwave/build-aux/cargo.sh ../Shortwave shortwave /usr/share/locale de.haeckerfelix.Shortwave '' 7.99.0 '' ninja: build stopped: subcommand failed. ==> ERROR: A failure occurred in build(). Aborting...

kouros17 commented on 2019-02-01 21:53 (UTC) (edited on 2019-02-01 21:53 (UTC) by kouros17)

@flipflop97

You 're right, I changed the theme to default and everything worked correctly! Thanks a lot! :)

flipflop97 commented on 2019-02-01 11:26 (UTC)

@kouros17

Do you have any custom styles in ~/.config/gtk-3.0/gtk.css? It seems like there is an error in that file (something with gtkalpha on line 12), so you can try fixing/removing that.

If that's not it it might be a problem with your GTK theme, so try compiling again with the default theme.

kouros17 commented on 2019-02-01 09:12 (UTC) (edited on 2019-02-01 09:14 (UTC) by kouros17)

@flipflop97 And this is the testlog.txt from meson-logs:

Log of Meson test suite run on 2019-02-01T11:09:29.551656

Inherited environment: SHELL='/usr/bin/zsh' LSCOLORS='Gxfxcxdxbxegedabagacad' SESSION_MANAGER='local/manjaro:@/tmp/.ICE-unix/988,unix/manjaro:/tmp/.ICE-unix/988' COLORTERM='truecolor' LESS='-R' XDG_MENU_PREFIX='gnome-' FREETYPE_PROPERTIES='truetype:interpreter-version=38' LC_ADDRESS='el_GR.UTF-8' LC_NAME='el_GR.UTF-8' SSH_AUTH_SOCK='/run/user/1000/keyring/ssh' TEXTDOMAINDIR='/usr/share/locale' DESKTOP_SESSION='gnome' LC_MONETARY='el_GR.UTF-8' EDITOR='/usr/bin/nano' DBUS_STARTER_BUS_TYPE='session' XDG_SEAT='seat0' PWD='/home/giorgos/Builds/libhandy-git/src/build' SOURCE_DATE_EPOCH='1549012155' LOGNAME='giorgos' XDG_SESSION_DESKTOP='gnome' QT_QPA_PLATFORMTHEME='qt5ct' XDG_SESSION_TYPE='x11' CXXFLAGS='-march=native -O2 -pipe -fstack-protector-strong' _='/usr/bin/meson' XAUTHORITY='/run/user/1000/gdm/Xauthority' WINDOWPATH='2' GDM_LANG='el_GR.UTF-8' COMMAND_MODE='legacy' LDFLAGS='-Wl,-O1,--sort-common,--as-needed,-z,relro,-z,now' HOME='/home/giorgos' USERNAME='giorgos' LANG='el_GR.UTF-8' LC_PAPER='el_GR.UTF-8' XDG_CURRENT_DESKTOP='GNOME' VTE_VERSION='5402' GNOME_TERMINAL_SCREEN='/org/gnome/Terminal/screen/9b7983cd_5990_418d_ab77_6749935e72cb' CPPFLAGS='-D_FORTIFY_SOURCE=2' INVOCATION_ID='9a83940d0926407681c6af1a51ef3d8e' MANAGERPID='805' XDG_SESSION_CLASS='user' MAKEFLAGS='-j16' LC_IDENTIFICATION='el_GR.UTF-8' TERM='xterm-256color' ZSH='/home/giorgos/.oh-my-zsh' USER='giorgos' GNOME_TERMINAL_SERVICE=':1.256' DISPLAY=':0' SHLVL='2' PAGER='less' LC_TELEPHONE='el_GR.UTF-8' INSIDE_NAUTILUS_PYTHON='' LC_MEASUREMENT='el_GR.UTF-8' XDG_VTNR='2' XDG_SESSION_ID='1' DBUS_STARTER_ADDRESS='unix:path=/run/user/1000/bus,guid=44ff563b1ccd67ecb23010de5c53f3eb' MOZ_PLUGIN_PATH='/usr/lib/mozilla/plugins' UPDATE_ZSH_DAYS='13' LC_CTYPE='en_US.UTF-8' XDG_RUNTIME_DIR='/run/user/1000' LC_TIME='el_GR.UTF-8' LC_ALL='C' JOURNAL_STREAM='9:20168' CHOST='x86_64-pc-linux-gnu' PATH='/usr/lib/ccache/bin:/usr/local/bin:/usr/local/sbin:/usr/bin:/usr/lib/jvm/default/bin:/usr/bin/site_perl:/usr/bin/vendor_perl:/usr/bin/core_perl:/usr/lib/jvm/default/bin:/usr/bin/site_perl:/usr/bin/vendor_perl:/usr/bin/core_perl' GDMSESSION='gnome' CFLAGS='-march=native -O2 -pipe -fstack-protector-strong' DBUS_SESSION_BUS_ADDRESS='unix:path=/run/user/1000/bus,guid=44ff563b1ccd67ecb23010de5c53f3eb' MAIL='/var/spool/mail/giorgos' LC_NUMERIC='el_GR.UTF-8' OLDPWD='/home/giorgos/Builds/libhandy-git/src' TEXTDOMAIN='pacman-scripts'

1/11 test-action-row FAIL 0.37 s (killed by signal 5 SIGTRAP)

--- command --- G_TEST_SRCDIR='/home/giorgos/Builds/libhandy-git/src/libhandy/tests' G_TEST_BUILDDIR='/home/giorgos/Builds/libhandy-git/src/build/tests' G_DEBUG='gc-friendly,fatal-warnings' GSETTINGS_BACKEND='memory' MALLOC_CHECK_='2' PYTHONDONTWRITEBYTECODE='yes' /home/giorgos/Builds/libhandy-git/src/build/tests/test-action-row --- stderr ---

(/home/giorgos/Builds/libhandy-git/src/build/tests/test-action-row:5355): Gtk-WARNING **: 11:09:29.569: Theme parsing error: gtk.css:12:80: 'gtkalpha' is not a valid color name

2/11 test-arrows FAIL 0.37 s (killed by signal 5 SIGTRAP)

--- command --- G_TEST_SRCDIR='/home/giorgos/Builds/libhandy-git/src/libhandy/tests' G_TEST_BUILDDIR='/home/giorgos/Builds/libhandy-git/src/build/tests' G_DEBUG='gc-friendly,fatal-warnings' GSETTINGS_BACKEND='memory' MALLOC_CHECK_='2' PYTHONDONTWRITEBYTECODE='yes' /home/giorgos/Builds/libhandy-git/src/build/tests/test-arrows --- stderr ---

(/home/giorgos/Builds/libhandy-git/src/build/tests/test-arrows:5357): Gtk-WARNING **: 11:09:29.572: Theme parsing error: gtk.css:12:80: 'gtkalpha' is not a valid color name

3/11 test-combo-row FAIL 0.37 s (killed by signal 5 SIGTRAP)

--- command --- G_TEST_SRCDIR='/home/giorgos/Builds/libhandy-git/src/libhandy/tests' G_TEST_BUILDDIR='/home/giorgos/Builds/libhandy-git/src/build/tests' G_DEBUG='gc-friendly,fatal-warnings' GSETTINGS_BACKEND='memory' MALLOC_CHECK_='2' PYTHONDONTWRITEBYTECODE='yes' /home/giorgos/Builds/libhandy-git/src/build/tests/test-combo-row --- stderr ---

(/home/giorgos/Builds/libhandy-git/src/build/tests/test-combo-row:5362): Gtk-WARNING **: 11:09:29.575: Theme parsing error: gtk.css:12:80: 'gtkalpha' is not a valid color name

4/11 test-dialer FAIL 0.37 s (killed by signal 5 SIGTRAP)

--- command --- G_TEST_SRCDIR='/home/giorgos/Builds/libhandy-git/src/libhandy/tests' G_TEST_BUILDDIR='/home/giorgos/Builds/libhandy-git/src/build/tests' G_DEBUG='gc-friendly,fatal-warnings' GSETTINGS_BACKEND='memory' MALLOC_CHECK_='2' PYTHONDONTWRITEBYTECODE='yes' /home/giorgos/Builds/libhandy-git/src/build/tests/test-dialer --- stderr ---

(/home/giorgos/Builds/libhandy-git/src/build/tests/test-dialer:5361): Gtk-WARNING **: 11:09:29.575: Theme parsing error: gtk.css:12:80: 'gtkalpha' is not a valid color name

5/11 test-dialer-cycle-button FAIL 0.32 s (killed by signal 5 SIGTRAP)

--- command --- G_TEST_SRCDIR='/home/giorgos/Builds/libhandy-git/src/libhandy/tests' G_TEST_BUILDDIR='/home/giorgos/Builds/libhandy-git/src/build/tests' G_DEBUG='gc-friendly,fatal-warnings' GSETTINGS_BACKEND='memory' MALLOC_CHECK_='2' PYTHONDONTWRITEBYTECODE='yes' /home/giorgos/Builds/libhandy-git/src/build/tests/test-dialer-cycle-button --- stderr ---

(/home/giorgos/Builds/libhandy-git/src/build/tests/test-dialer-cycle-button:5364): Gtk-WARNING **: 11:09:29.578: Theme parsing error: gtk.css:12:80: 'gtkalpha' is not a valid color name

6/11 test-dialog FAIL 0.32 s (killed by signal 5 SIGTRAP)

--- command --- G_TEST_SRCDIR='/home/giorgos/Builds/libhandy-git/src/libhandy/tests' G_TEST_BUILDDIR='/home/giorgos/Builds/libhandy-git/src/build/tests' G_DEBUG='gc-friendly,fatal-warnings' GSETTINGS_BACKEND='memory' MALLOC_CHECK_='2' PYTHONDONTWRITEBYTECODE='yes' /home/giorgos/Builds/libhandy-git/src/build/tests/test-dialog --- stderr ---

(/home/giorgos/Builds/libhandy-git/src/build/tests/test-dialog:5366): Gtk-WARNING **: 11:09:29.582: Theme parsing error: gtk.css:12:80: 'gtkalpha' is not a valid color name

7/11 test-expander-row FAIL 0.32 s (killed by signal 5 SIGTRAP)

--- command --- G_TEST_SRCDIR='/home/giorgos/Builds/libhandy-git/src/libhandy/tests' G_TEST_BUILDDIR='/home/giorgos/Builds/libhandy-git/src/build/tests' G_DEBUG='gc-friendly,fatal-warnings' GSETTINGS_BACKEND='memory' MALLOC_CHECK_='2' PYTHONDONTWRITEBYTECODE='yes' /home/giorgos/Builds/libhandy-git/src/build/tests/test-expander-row --- stderr ---

(/home/giorgos/Builds/libhandy-git/src/build/tests/test-expander-row:5368): Gtk-WARNING **: 11:09:29.582: Theme parsing error: gtk.css:12:80: 'gtkalpha' is not a valid color name

8/11 test-header-group FAIL 0.37 s (killed by signal 5 SIGTRAP)

--- command --- G_TEST_SRCDIR='/home/giorgos/Builds/libhandy-git/src/libhandy/tests' G_TEST_BUILDDIR='/home/giorgos/Builds/libhandy-git/src/build/tests' G_DEBUG='gc-friendly,fatal-warnings' GSETTINGS_BACKEND='memory' MALLOC_CHECK_='2' PYTHONDONTWRITEBYTECODE='yes' /home/giorgos/Builds/libhandy-git/src/build/tests/test-header-group --- stderr ---

(/home/giorgos/Builds/libhandy-git/src/build/tests/test-header-group:5369): Gtk-WARNING **: 11:09:29.583: Theme parsing error: gtk.css:12:80: 'gtkalpha' is not a valid color name

9/11 test-search-bar FAIL 0.37 s (killed by signal 5 SIGTRAP)

--- command --- G_TEST_SRCDIR='/home/giorgos/Builds/libhandy-git/src/libhandy/tests' G_TEST_BUILDDIR='/home/giorgos/Builds/libhandy-git/src/build/tests' G_DEBUG='gc-friendly,fatal-warnings' GSETTINGS_BACKEND='memory' MALLOC_CHECK_='2' PYTHONDONTWRITEBYTECODE='yes' /home/giorgos/Builds/libhandy-git/src/build/tests/test-search-bar --- stderr ---

(/home/giorgos/Builds/libhandy-git/src/build/tests/test-search-bar:5373): Gtk-WARNING **: 11:09:29.587: Theme parsing error: gtk.css:12:80: 'gtkalpha' is not a valid color name

10/11 test-string-utf8 FAIL 0.27 s (killed by signal 5 SIGTRAP)

--- command --- G_TEST_SRCDIR='/home/giorgos/Builds/libhandy-git/src/libhandy/tests' G_TEST_BUILDDIR='/home/giorgos/Builds/libhandy-git/src/build/tests' G_DEBUG='gc-friendly,fatal-warnings' GSETTINGS_BACKEND='memory' MALLOC_CHECK_='2' PYTHONDONTWRITEBYTECODE='yes' /home/giorgos/Builds/libhandy-git/src/build/tests/test-string-utf8 --- stderr ---

(/home/giorgos/Builds/libhandy-git/src/build/tests/test-string-utf8:5377): Gtk-WARNING **: 11:09:29.588: Theme parsing error: gtk.css:12:80: 'gtkalpha' is not a valid color name

11/11 test-value-object FAIL 0.32 s (killed by signal 5 SIGTRAP)

--- command --- G_TEST_SRCDIR='/home/giorgos/Builds/libhandy-git/src/libhandy/tests' G_TEST_BUILDDIR='/home/giorgos/Builds/libhandy-git/src/build/tests' G_DEBUG='gc-friendly,fatal-warnings' GSETTINGS_BACKEND='memory' MALLOC_CHECK_='2' PYTHONDONTWRITEBYTECODE='yes' /home/giorgos/Builds/libhandy-git/src/build/tests/test-value-object --- stderr ---

(/home/giorgos/Builds/libhandy-git/src/build/tests/test-value-object:5379): Gtk-WARNING **: 11:09:29.590: Theme parsing error: gtk.css:12:80: 'gtkalpha' is not a valid color name

Ok: 0 Expected Fail: 0 Fail: 11 Unexpected Pass: 0 Skipped: 0 Timeout: 0

kouros17 commented on 2019-02-01 09:02 (UTC) (edited on 2019-02-01 09:04 (UTC) by kouros17)

@flipflop97

==> Making package: libhandy-git 0.0.6.r2.g737f8a8-1 (Fri Feb 1 10:58:25 2019) ==> Checking runtime dependencies... ==> Checking buildtime dependencies... ==> Installing missing dependencies... [sudo] password for giorgos: resolving dependencies... looking for conflicting packages...

Package (14) New Version Net Change

extra/docbook-xml 4.5-8 1.97 MiB extra/docbook-xsl 1.79.2-4 13.15 MiB core/glib2-docs 2.58.3-1 19.70 MiB extra/graphviz 2.40.1-14 15.74 MiB extra/gtk-doc 1.29-1 2.77 MiB extra/gts 0.7.6-5 0.62 MiB community/ninja 1.8.2-1 0.31 MiB extra/python-anytree 2.4.3-2 0.24 MiB extra/python-lxml 4.3.0-1 4.39 MiB community/python-pygments 2.3.1-1 6.97 MiB extra/source-highlight 3.1.8-18 3.16 MiB extra/glade 3.22.1-2 11.61 MiB extra/meson 0.49.1-1 3.99 MiB extra/vala 0.42.5-1 12.80 MiB

Total Installed Size: 97.42 MiB

:: Proceed with installation? [Y/n] y (14/14) checking keys in keyring [----------------------------] 100% (14/14) checking package integrity [----------------------------] 100% (14/14) loading package files [----------------------------] 100% (14/14) checking for file conflicts [----------------------------] 100% :: Processing package changes... ( 1/14) installing glade [----------------------------] 100% Optional dependencies for glade devhelp: development help ( 2/14) installing ninja [----------------------------] 100% ( 3/14) installing meson [----------------------------] 100% ( 4/14) installing docbook-xml [----------------------------] 100% ( 5/14) installing docbook-xsl [----------------------------] 100% ( 6/14) installing source-highlight [----------------------------] 100% ( 7/14) installing glib2-docs [----------------------------] 100% ( 8/14) installing python-lxml [----------------------------] 100% Optional dependencies for python-lxml python-beautifulsoup4: support for beautifulsoup parser to parse not well formed HTML [installed] python-cssselect: support for cssselect python-html5lib: support for html5lib parser python-lxml-docs: offline docs ( 9/14) installing python-pygments [----------------------------] 100% (10/14) installing python-anytree [----------------------------] 100% (11/14) installing gtk-doc [----------------------------] 100% Optional dependencies for gtk-doc dblatex: PDF support (12/14) installing gts [----------------------------] 100% (13/14) installing graphviz [----------------------------] 100% Optional dependencies for graphviz mono: sharp bindings [installed] guile: guile bindings [installed] lua: lua bindings [installed] ocaml: ocaml bindings perl: perl bindings [installed] python2: python bindings [installed] r: r bindings tcl: tcl bindings [installed] qt4: gvedit gtk2: gtk output plugin [installed] xterm: vimdot (14/14) installing vala [----------------------------] 100% :: Running post-transaction hooks... (1/5) Warn about old perl modules (2/5) Updating icon theme caches... (3/5) Arming ConditionNeedsUpdate... (4/5) Updating the info directory file... (5/5) Updating the desktop file MIME type cache... ==> Retrieving sources... -> Cloning libhandy git repo... Cloning into bare repository '/home/giorgos/Builds/libhandy-git/libhandy'... remote: Enumerating objects: 2083, done. remote: Counting objects: 100% (2083/2083), done. remote: Compressing objects: 100% (872/872), done. remote: Total 2083 (delta 1388), reused 1773 (delta 1159) Receiving objects: 100% (2083/2083), 421.10 KiB | 960.00 KiB/s, done. Resolving deltas: 100% (1388/1388), done. ==> Validating source files with md5sums... libhandy ... Skipped ==> Extracting sources... -> Creating working copy of libhandy git repo... Cloning into 'libhandy'... done. ==> Starting pkgver()... ==> Updated version: libhandy-git 0.0.7.r20.g6179d15-1 ==> Starting build()... + exec meson setup --prefix /usr --libdir /usr/lib --libexecdir /usr/lib --bindir /usr/bin --sbindir /usr/bin --includedir /usr/include --datadir /usr/share --mandir /usr/share/man --infodir /usr/share/info --localedir /usr/share/locale --sysconfdir /etc --localstatedir /var --sharedstatedir /var/lib --buildtype release --auto-features enabled --wrap-mode nofallback -D b_lto=true -D b_pie=true libhandy build -Dexamples=false -Dgtk_doc=true The Meson build system Version: 0.49.1 Source dir: /home/giorgos/Builds/libhandy-git/src/libhandy Build dir: /home/giorgos/Builds/libhandy-git/src/build Build type: native build Project name: libhandy Project version: 0.0.7 Appending CFLAGS from environment: '-march=native -O2 -pipe -fstack-protector-strong' Appending LDFLAGS from environment: '-Wl,-O1,--sort-common,--as-needed,-z,relro,-z,now' Appending CPPFLAGS from environment: '-D_FORTIFY_SOURCE=2' Native C compiler: ccache cc (gcc 8.2.1 "cc (GCC) 8.2.1 20181127") Build machine cpu family: x86_64 Build machine cpu: x86_64 Configuring config.h using configuration Compiler for C supports arguments -Wcast-align: YES Compiler for C supports arguments -Wdate-time: YES Compiler for C supports arguments -Wdeclaration-after-statement: YES Compiler for C supports arguments -Werror=format-security -Werror=format=2: YES Compiler for C supports arguments -Wendif-labels: YES Compiler for C supports arguments -Werror=incompatible-pointer-types: YES Compiler for C supports arguments -Werror=missing-declarations: YES Compiler for C supports arguments -Werror=overflow: YES Compiler for C supports arguments -Werror=return-type: YES Compiler for C supports arguments -Werror=shift-count-overflow: YES Compiler for C supports arguments -Werror=shift-overflow=2: YES Compiler for C supports arguments -Werror=implicit-fallthrough=3: YES Compiler for C supports arguments -Wformat-nonliteral: YES Compiler for C supports arguments -Wformat-security: YES Compiler for C supports arguments -Winit-self: YES Compiler for C supports arguments -Wmaybe-uninitialized: YES Compiler for C supports arguments -Wmissing-field-initializers: YES Compiler for C supports arguments -Wmissing-include-dirs: YES Compiler for C supports arguments -Wmissing-noreturn: YES Compiler for C supports arguments -Wnested-externs: YES Compiler for C supports arguments -Wno-missing-field-initializers -Wmissing-field-initializers: YES Compiler for C supports arguments -Wno-sign-compare -Wsign-compare: YES Compiler for C supports arguments -Wno-strict-aliasing -Wstrict-aliasing: YES Compiler for C supports arguments -Wno-unused-parameter -Wunused-parameter: YES Compiler for C supports arguments -Wold-style-definition: YES Compiler for C supports arguments -Wpointer-arith: YES Compiler for C supports arguments -Wredundant-decls: YES Compiler for C supports arguments -Wshadow: YES Compiler for C supports arguments -Wstrict-prototypes: YES Compiler for C supports arguments -Wswitch-default: YES Compiler for C supports arguments -Wswitch-enum: YES Compiler for C supports arguments -Wtype-limits: YES Compiler for C supports arguments -Wundef: YES Compiler for C supports arguments -Wunused-function: YES Compiler for C supports arguments -fstack-protector-strong: YES Found pkg-config: /usr/bin/pkg-config (1.6.0) Dependency gladeui-2.0 found: YES 3.22.1 Configuring hdy-version.h using configuration Program sed found: YES (/usr/bin/sed) Program gen-public-types.sh found: YES (/bin/sh /home/giorgos/Builds/libhandy-git/src/libhandy/src/gen-public-types.sh) Dependency glib-2.0 found: YES 2.58.3 Dependency gio-2.0 found: YES 2.58.3 Dependency gmodule-2.0 found: YES 2.58.3 Dependency gtk+-3.0 found: YES 3.24.4 Library m found: YES Library rt found: YES Checking if "ld_supports_version_script" links: YES WARNING: Use the 'pie' kwarg instead of passing '-fpie' manually to 'test-action-row' WARNING: Use the 'pie' kwarg instead of passing '-fpie' manually to 'test-arrows' WARNING: Use the 'pie' kwarg instead of passing '-fpie' manually to 'test-combo-row' WARNING: Use the 'pie' kwarg instead of passing '-fpie' manually to 'test-dialer' WARNING: Use the 'pie' kwarg instead of passing '-fpie' manually to 'test-dialer-cycle-button' WARNING: Use the 'pie' kwarg instead of passing '-fpie' manually to 'test-dialog' WARNING: Use the 'pie' kwarg instead of passing '-fpie' manually to 'test-expander-row' WARNING: Use the 'pie' kwarg instead of passing '-fpie' manually to 'test-header-group' WARNING: Use the 'pie' kwarg instead of passing '-fpie' manually to 'test-search-bar' WARNING: Use the 'pie' kwarg instead of passing '-fpie' manually to 'test-string-utf8' WARNING: Use the 'pie' kwarg instead of passing '-fpie' manually to 'test-value-object' Configuring gtkdocentities.ent using configuration Program xmllint found: YES (/usr/bin/xmllint) Configuring run using configuration Message:


Handy 0 (0.0)

         Tests: true
      Examples: false
 Documentation: true
        Static: false
 Introspection: true
          Vapi: true
 Glade Catalog: true

Build targets in project: 26 Option buildtype is: release [default: debugoptimized] Found ninja-1.8.2 at /usr/bin/ninja ninja: Entering directory build' [56/58] Generating Handy-0.0.gir with a custom command. In file included from /usr/include/bits/libc-header-start.h:33, from /usr/include/limits.h:26, from /usr/lib/gcc/x86_64-pc-linux-gnu/8.2.1/include-fixed/limits.h:194, from /usr/lib/gcc/x86_64-pc-linux-gnu/8.2.1/include-fixed/syslimits.h:7, from /usr/lib/gcc/x86_64-pc-linux-gnu/8.2.1/include-fixed/limits.h:34, from /usr/lib/glib-2.0/include/glibconfig.h:11, from /usr/include/glib-2.0/glib/gtypes.h:32, from /usr/include/glib-2.0/glib/galloca.h:32, from /usr/include/glib-2.0/glib.h:30, from /usr/include/glib-2.0/gobject/gbinding.h:28, from /usr/include/glib-2.0/glib-object.h:23, from /home/giorgos/Builds/libhandy-git/src/build/src/hdy-enums.h:10, from /home/giorgos/Builds/libhandy-git/src/build/g-ir-cpp-t30_nh34.c:4: /usr/include/features.h:381:4: warning: #warning _FORTIFY_SOURCE requires compiling with optimization (-O) [-Wcpp] # warning _FORTIFY_SOURCE requires compiling with optimization (-O) ^~~~~~~ libhandy/src/hdy-main.c:26: Warning: Handy: invalid "optional" annotation: only valid for out parameters libhandy/src/hdy-main.c:29: Warning: Handy: invalid "optional" annotation: only valid for out parameters [58/58] Generating Handy-0.0.typelib with a custom command. ==> Starting check()... ninja: Entering directorybuild' [1/2] Running all tests. 1/11 test-action-row FAIL 0.33 s (killed by signal 5 SIGTRAP) 2/11 test-arrows FAIL 0.38 s (killed by signal 5 SIGTRAP) 3/11 test-combo-row FAIL 0.37 s (killed by signal 5 SIGTRAP) 4/11 test-dialer FAIL 0.33 s (killed by signal 5 SIGTRAP) 5/11 test-dialer-cycle-button FAIL 0.37 s (killed by signal 5 SIGTRAP) 6/11 test-dialog FAIL 0.38 s (killed by signal 5 SIGTRAP) 7/11 test-expander-row FAIL 0.38 s (killed by signal 5 SIGTRAP) 8/11 test-header-group FAIL 0.37 s (killed by signal 5 SIGTRAP) 9/11 test-search-bar FAIL 0.37 s (killed by signal 5 SIGTRAP) 10/11 test-string-utf8 FAIL 0.32 s (killed by signal 5 SIGTRAP) 11/11 test-value-object FAIL 0.37 s (killed by signal 5 SIGTRAP)

Ok: 0 Expected Fail: 0 Fail: 11 Unexpected Pass: 0 Skipped: 0 Timeout: 0

The output from 10 first failed tests:

1/11 test-action-row FAIL 0.33 s (killed by signal 5 SIGTRAP)

--- command --- MALLOC_CHECK_='2' G_DEBUG='gc-friendly,fatal-warnings' GSETTINGS_BACKEND='memory' PYTHONDONTWRITEBYTECODE='yes' G_TEST_SRCDIR='/home/giorgos/Builds/libhandy-git/src/libhandy/tests' G_TEST_BUILDDIR='/home/giorgos/Builds/libhandy-git/src/build/tests' /home/giorgos/Builds/libhandy-git/src/build/tests/test-action-row --- stderr ---

(/home/giorgos/Builds/libhandy-git/src/build/tests/test-action-row:28776): Gtk-WARNING **: 10:58:40.059: Theme parsing error: gtk.css:12:80: 'gtkalpha' is not a valid color name

2/11 test-arrows FAIL 0.38 s (killed by signal 5 SIGTRAP)

--- command --- MALLOC_CHECK_='2' G_DEBUG='gc-friendly,fatal-warnings' GSETTINGS_BACKEND='memory' PYTHONDONTWRITEBYTECODE='yes' G_TEST_SRCDIR='/home/giorgos/Builds/libhandy-git/src/libhandy/tests' G_TEST_BUILDDIR='/home/giorgos/Builds/libhandy-git/src/build/tests' /home/giorgos/Builds/libhandy-git/src/build/tests/test-arrows --- stderr ---

(/home/giorgos/Builds/libhandy-git/src/build/tests/test-arrows:28788): Gtk-WARNING **: 10:58:40.074: Theme parsing error: gtk.css:12:80: 'gtkalpha' is not a valid color name

3/11 test-combo-row FAIL 0.37 s (killed by signal 5 SIGTRAP)

--- command --- MALLOC_CHECK_='2' G_DEBUG='gc-friendly,fatal-warnings' GSETTINGS_BACKEND='memory' PYTHONDONTWRITEBYTECODE='yes' G_TEST_SRCDIR='/home/giorgos/Builds/libhandy-git/src/libhandy/tests' G_TEST_BUILDDIR='/home/giorgos/Builds/libhandy-git/src/build/tests' /home/giorgos/Builds/libhandy-git/src/build/tests/test-combo-row --- stderr ---

(/home/giorgos/Builds/libhandy-git/src/build/tests/test-combo-row:28775): Gtk-WARNING **: 10:58:40.059: Theme parsing error: gtk.css:12:80: 'gtkalpha' is not a valid color name

4/11 test-dialer FAIL 0.33 s (killed by signal 5 SIGTRAP)

--- command --- MALLOC_CHECK_='2' G_DEBUG='gc-friendly,fatal-warnings' GSETTINGS_BACKEND='memory' PYTHONDONTWRITEBYTECODE='yes' G_TEST_SRCDIR='/home/giorgos/Builds/libhandy-git/src/libhandy/tests' G_TEST_BUILDDIR='/home/giorgos/Builds/libhandy-git/src/build/tests' /home/giorgos/Builds/libhandy-git/src/build/tests/test-dialer --- stderr ---

(/home/giorgos/Builds/libhandy-git/src/build/tests/test-dialer:28785): Gtk-WARNING **: 10:58:40.068: Theme parsing error: gtk.css:12:80: 'gtkalpha' is not a valid color name

5/11 test-dialer-cycle-button FAIL 0.37 s (killed by signal 5 SIGTRAP)

--- command --- MALLOC_CHECK_='2' G_DEBUG='gc-friendly,fatal-warnings' GSETTINGS_BACKEND='memory' PYTHONDONTWRITEBYTECODE='yes' G_TEST_SRCDIR='/home/giorgos/Builds/libhandy-git/src/libhandy/tests' G_TEST_BUILDDIR='/home/giorgos/Builds/libhandy-git/src/build/tests' /home/giorgos/Builds/libhandy-git/src/build/tests/test-dialer-cycle-button --- stderr ---

(/home/giorgos/Builds/libhandy-git/src/build/tests/test-dialer-cycle-button:28777): Gtk-WARNING **: 10:58:40.061: Theme parsing error: gtk.css:12:80: 'gtkalpha' is not a valid color name

6/11 test-dialog FAIL 0.38 s (killed by signal 5 SIGTRAP)

--- command --- MALLOC_CHECK_='2' G_DEBUG='gc-friendly,fatal-warnings' GSETTINGS_BACKEND='memory' PYTHONDONTWRITEBYTECODE='yes' G_TEST_SRCDIR='/home/giorgos/Builds/libhandy-git/src/libhandy/tests' G_TEST_BUILDDIR='/home/giorgos/Builds/libhandy-git/src/build/tests' /home/giorgos/Builds/libhandy-git/src/build/tests/test-dialog --- stderr ---

(/home/giorgos/Builds/libhandy-git/src/build/tests/test-dialog:28784): Gtk-WARNING **: 10:58:40.071: Theme parsing error: gtk.css:12:80: 'gtkalpha' is not a valid color name

7/11 test-expander-row FAIL 0.38 s (killed by signal 5 SIGTRAP)

--- command --- MALLOC_CHECK_='2' G_DEBUG='gc-friendly,fatal-warnings' GSETTINGS_BACKEND='memory' PYTHONDONTWRITEBYTECODE='yes' G_TEST_SRCDIR='/home/giorgos/Builds/libhandy-git/src/libhandy/tests' G_TEST_BUILDDIR='/home/giorgos/Builds/libhandy-git/src/build/tests' /home/giorgos/Builds/libhandy-git/src/build/tests/test-expander-row --- stderr ---

(/home/giorgos/Builds/libhandy-git/src/build/tests/test-expander-row:28782): Gtk-WARNING **: 10:58:40.068: Theme parsing error: gtk.css:12:80: 'gtkalpha' is not a valid color name

8/11 test-header-group FAIL 0.37 s (killed by signal 5 SIGTRAP)

--- command --- MALLOC_CHECK_='2' G_DEBUG='gc-friendly,fatal-warnings' GSETTINGS_BACKEND='memory' PYTHONDONTWRITEBYTECODE='yes' G_TEST_SRCDIR='/home/giorgos/Builds/libhandy-git/src/libhandy/tests' G_TEST_BUILDDIR='/home/giorgos/Builds/libhandy-git/src/build/tests' /home/giorgos/Builds/libhandy-git/src/build/tests/test-header-group --- stderr ---

(/home/giorgos/Builds/libhandy-git/src/build/tests/test-header-group:28778): Gtk-WARNING **: 10:58:40.061: Theme parsing error: gtk.css:12:80: 'gtkalpha' is not a valid color name

9/11 test-search-bar FAIL 0.37 s (killed by signal 5 SIGTRAP)

--- command --- MALLOC_CHECK_='2' G_DEBUG='gc-friendly,fatal-warnings' GSETTINGS_BACKEND='memory' PYTHONDONTWRITEBYTECODE='yes' G_TEST_SRCDIR='/home/giorgos/Builds/libhandy-git/src/libhandy/tests' G_TEST_BUILDDIR='/home/giorgos/Builds/libhandy-git/src/build/tests' /home/giorgos/Builds/libhandy-git/src/build/tests/test-search-bar --- stderr ---

(/home/giorgos/Builds/libhandy-git/src/build/tests/test-search-bar:28783): Gtk-WARNING **: 10:58:40.068: Theme parsing error: gtk.css:12:80: 'gtkalpha' is not a valid color name

10/11 test-string-utf8 FAIL 0.32 s (killed by signal 5 SIGTRAP)

--- command --- MALLOC_CHECK_='2' G_DEBUG='gc-friendly,fatal-warnings' GSETTINGS_BACKEND='memory' PYTHONDONTWRITEBYTECODE='yes' G_TEST_SRCDIR='/home/giorgos/Builds/libhandy-git/src/libhandy/tests' G_TEST_BUILDDIR='/home/giorgos/Builds/libhandy-git/src/build/tests' /home/giorgos/Builds/libhandy-git/src/build/tests/test-string-utf8 --- stderr ---

(/home/giorgos/Builds/libhandy-git/src/build/tests/test-string-utf8:28787): Gtk-WARNING **: 10:58:40.072: Theme parsing error: gtk.css:12:80: 'gtkalpha' is not a valid color name

Full log written to /home/giorgos/Builds/libhandy-git/src/build/meson-logs/testlog.txt FAILED: meson-test /usr/bin/meson test --no-rebuild --print-errorlogs ninja: build stopped: subcommand failed. ==> ERROR: A failure occurred in check(). Aborting...

flipflop97 commented on 2019-02-01 08:42 (UTC)

@kouros17

Can you post the output of the build and check phase, prior to this error?

kouros17 commented on 2019-02-01 08:27 (UTC) (edited on 2019-02-01 09:15 (UTC) by kouros17)

@ flipflop97 When I'm trying to build libhandy-git from aur I get:

FAILED: meson-test /usr/bin/meson test --no-rebuild --print-errorlogs ninja: build stopped: subcommand failed. ==> ERROR: A failure occurred in check(). Aborting...

flipflop97 commented on 2019-01-31 09:19 (UTC) (edited on 2019-01-31 09:19 (UTC) by flipflop97)

@kouros17

The last line of your error shows what's wrong:
libhandy 0.0.7 is needed while 0.0.6 is installed. Since the repo version is out of date you'll have to fall back and install libhandy-git for now.

kouros17 commented on 2019-01-31 08:14 (UTC) (edited on 2019-01-31 08:35 (UTC) by kouros17)

I'm using manjaro and I get:

"error: failed to run custom build command for libhandy-sys v0.2.0 (<https://gitlab.gnome.org/World/Rust/libhandy-rs#c63cc611>) process didn't exit successfully: /home/giorgos/Builds/shortwave-git/src/Shortwave/target/release/build/libhandy-sys-ff396523c0a0db4d/build-script-build (exit code: 1) --- stderr "pkg-config" "--libs" "--cflags" "libhandy-0.0 >= 0.0.7" did not exit successfully: exit code: 1 --- stderr Package dependency requirement 'libhandy-0.0 >= 0.0.7' could not be satisfied. Package 'libhandy-0.0' has version '0.0.6', required version is '>= 0.0.7'"