Package Details: shutter 0.94.3-1

Git Clone URL: https://aur.archlinux.org/shutter.git (read-only, click to copy)
Package Base: shutter
Description: A featureful screenshot tool (formerly gscrot)
Upstream URL: https://shutter-project.org/
Licenses: GPL3
Submitter: City-busz
Maintainer: PhotonX
Last Packager: PhotonX
Votes: 92
Popularity: 0.83
First Submitted: 2017-01-24 12:16
Last Updated: 2020-06-26 13:48

Required by (0)

Sources (1)

Pinned Comments

Ralf_Mardorf commented on 2017-09-03 13:25

Follow the announcement to "get a list of affected packages":

[rocketmouse@archlinux ~]$ pacman -Qqo '/usr/lib/perl5/vendor_perl'
gnome-perl
gnome-vfs-perl
gnomecanvas-perl
perl-gnome2-wnck
perl-goo-canvas
perl-gtk2-imageview
perl-gtk2-unique

Check dependencies:

[rocketmouse@archlinux ~]$ pacman -Qi gnome-perl | grep Depends\ On
Depends On : gnomecanvas-perl gnome-vfs-perl libgnomeui perl

Proper would be to check build dependencies.

Build after increasing the pkgrel of the PKGBUILDs:

[rocketmouse@archlinux ~]$ yaourt -S gnomecanvas-perl gnome-vfs-perl
[snip]
[rocketmouse@archlinux ~]$ yaourt -S gnome-perl perl-gnome2-wnck perl-goo-canvas perl-gtk2-imageview perl-gtk2-unique
[snip]

Then launch shutter:

[rocketmouse@archlinux ~]$ shutter >/dev/null 2>&1

Take a screenshot and edit the screenshot.

Latest Comments

« First ‹ Previous ... 8 9 10 11 12 13 14 15 16 Next › Last »

PhotonX commented on 2017-04-15 08:21

@lockheed: Please report this problem here: https://aur.archlinux.org/packages/gnome-vfs-nosmb/

lockheed commented on 2017-04-14 20:49

Since months it has been impossible to install shutter because gnome-vfs-nosmb does not compile:

make[3]: *** [Makefile:1040: install-libgnomevfsincludeHEADERS] Error 127
make[3]: *** Waiting for unfinished jobs....
../0 -m 644 gnome-vfs-cancellable-ops.h gnome-vfs-inet-connection.h gnome-vfs-method.h gnome-vfs-mime-info.h gnome-vfs-module-callback-module-api.h gnome-vfs-module-shared.h gnome-vfs-module.h gnome-vfs-parse-ls.h gnome-vfs-ssl.h gnome-vfs-transform.h gnome-vfs-socket-buffer.h gnome-vfs-socket.h gnome-vfs-pty.h '/tmp/yaourt-tmp-juha/aur-gnome-vfs-nosmb/pkg/gnome-vfs-nosmb/usr/include/gnome-vfs-module-2.0/libgnomevfs'
/bin/sh: line 11: ../0: No such file or directory
make[3]: *** [Makefile:1061: install-libgnomevfsmoduleincludeHEADERS] Error 127
libtool: install: ../0 .libs/libgnomevfs-2.so.0.2400.4 /tmp/yaourt-tmp-juha/aur-gnome-vfs-nosmb/pkg/gnome-vfs-nosmb/usr/lib/libgnomevfs-2.so.0.2400.4
../libtool: line 1723: ../0: No such file or directory
make[3]: *** [Makefile:884: install-libLTLIBRARIES] Error 127
make[3]: Leaving directory '/tmp/yaourt-tmp-juha/aur-gnome-vfs-nosmb/src/gnome-vfs-2.24.4/libgnomevfs'
make[2]: *** [Makefile:1199: install-am] Error 2
make[2]: Leaving directory '/tmp/yaourt-tmp-juha/aur-gnome-vfs-nosmb/src/gnome-vfs-2.24.4/libgnomevfs'
make[1]: *** [Makefile:1193: install] Error 2
make[1]: Leaving directory '/tmp/yaourt-tmp-juha/aur-gnome-vfs-nosmb/src/gnome-vfs-2.24.4/libgnomevfs'
make: *** [Makefile:615: install-recursive] Error 1
==> ERROR: A failure occurred in package().
Aborting...

PhotonX commented on 2017-03-05 19:37

@FadeMind: Looks like a problem with the XServer. Could you give more details on your video card and driver? See here, for example: https://bbs.archlinux.org/viewtopic.php?id=123176

FadeMind commented on 2017-03-05 17:42

FS#50419 - [shutter] 0.93.1-2 Cannot take screenshot of a window, when shutter is already started
https://bugs.archlinux.org/task/50419
-> Not reproducible, please give more details in the comments!
Full log: https://pastebin.com/raw/47L6qMnr

Lastest lines:

screenshot successfully saved to /home/fademind/Obrazy/Pulpit 1_004.png!

fct_update_tray_menu was called by Gnome2::Wnck::Screen=HASH(0x3ea0d38)
The program 'shutter' received an X Window System error.
This probably reflects a bug in the program.
The error was 'BadWindow (invalid Window parameter)'.
(Details: serial 5152 error_code 3 request_code 18 minor_code 0)
(Note to programmers: normally, X errors are reported asynchronously;
that is, you will receive the error a while after causing it.
To debug your program, run it with the --sync command line
option to change this behavior. You can then get a meaningful
backtrace from your debugger if you break on the gdk_x_error() function.)

PhotonX commented on 2017-03-03 07:26

@charlesarch: Glad that it worked, welcome to Arch and have a good journey! :)

charlesarch commented on 2017-03-03 05:47

@PhotonX Installed with pacaur. It went ok. Not sure why it worked this time, but I did used yaourt to install a few dependencies before giving pacaur another try.

New to Arch, (Fresh install last Sunday), (after a long time with Ubuntu/Mint). Thanks for helping.

PhotonX commented on 2017-03-02 17:45

@shahinism: Cool, thanks for clarifying!

@charlesarch, kodiak: Can you confirm this?

@Spyhawk: Seems like a false alarm, sorry for disturbing. :)

shahinism commented on 2017-03-02 17:35

@Photonx Just installed it using Pacaur with no more problem.

PhotonX commented on 2017-03-02 10:45

@Spyhawk: But I checked all involved packages (gnome-perl, gnome-vfs-perl and gnomecanvas-perl), both the .SRCINFO and the PKGBUILD, there is nowhere a reference to "perl<"...

PhotonX commented on 2017-03-02 08:03

Asked the pacaur developer for support, I'm really out of ideas.