Package Details: simon-kf5-git 0.5-1

Git Clone URL: https://aur.archlinux.org/simon-kf5-git.git (read-only)
Package Base: simon-kf5-git
Description: Simon is an open source speech recognition program that can replace your mouse and keyboard. The system is designed to be as flexible as possible and will work with any language or dialect
Upstream URL: https://simon.kde.org/
Licenses: GPLv2
Conflicts: simon
Submitter: davvore33
Maintainer: davvore33
Last Packager: davvore33
Votes: 0
Popularity: 0.000000
First Submitted: 2017-09-15 15:39
Last Updated: 2017-10-01 09:46

Dependencies (7)

Required by (0)

Sources (1)

Latest Comments

davvore33 commented on 2019-02-03 13:49

Hi @zoe, sorry didn't compiled this in long time, so I wasn't able to recreate your error but I've got another one which, I presume, it's a compatibility problem with the version of kf5 libs I'm using (KDE Frameworks: 5.54.0)

Here is the error
/home/matteo/Documents/aur/simon-kf5-git/src/simon/plugins/Conditions/DBus/createdbusconditionwidget.cpp: In constructor ‘CreateDBusConditionWidget::CreateDBusConditionWidget(QWidget*)’:
/home/matteo/Documents/aur/simon-kf5-git/src/simon/plugins/Conditions/DBus/createdbusconditionwidget.cpp:32:24: error: incomplete type ‘QIcon’ used in nested name specifier
setWindowIcon(QIcon::fromTheme("network-connect"));
                        ^~~~~~~~~
make[2]: *** [plugins/Conditions/DBus/CMakeFiles/simondbusconditionplugin.dir/build.make:80: plugins/Conditions/DBus/CMakeFiles/simondbusconditionplugin.dir/createdbusconditionwidget.cpp.o] Error 1
make[1]: *** [CMakeFiles/Makefile2:8891: plugins/Conditions/DBus/CMakeFiles/simondbusconditionplugin.dir/all] Error 2
make: *** [Makefile:163: all] Error 2
==> ERROR: A failure occurred in build().
    Aborting...

zoe commented on 2019-01-17 11:36

Hi, sphynxbase is required as dependency, please add it. But even when added, it does not build :

  /usr/include/KF5/KCalCore/kcalcore/event.h:126:10: note:   pas de conversion connue pour convertir l'argument 1 depuis « KDateTime » vers « const QDateTime& »
  /var/cache/pacman/AUR/yay/simon-kf5-git/src/simon/plugins/Commands/Akonadi/akonadicommandmanager.cpp:146:41: error: conversion de « QDateTime » vers le type non scalaire « KDateTime » demandée
       KDateTime startDate = event->dtStart();
                             ~~~~~~~~~~~~~~^~
   /var/cache/pacman/AUR/yay/simon-kf5-git/src/simon/plugins/Commands/Akonadi/akonadicommandmanager.cpp:147:37: error: conversion de « QDateTime » vers le type non scalaire « KDateTime » demandée
       KDateTime endDate = event->dtEnd();
                            ~~~~~~~~~~~~^~
   /var/cache/pacman/AUR/yay/simon-kf5-git/src/simon/plugins/Commands/Akonadi/akonadicommandmanager.cpp:153:41: error: « class QDateTime » n'a pas de membre nommé « dateTime »; vouliez-vous utiliser « QDateTime » ?
           QDateTime alarmDate = (a->time().dateTime());
                                            ^~~~~~~~
                                           QDateTime
  /var/cache/pacman/AUR/yay/simon-kf5-git/src/simon/plugins/Commands/Akonadi/akonadicommandmanager.cpp:158:34: error: « class QDateTime » n'a pas de membre nommé « dateTime »; vouliez-vous utiliser « QDateTime » ?
          schedule.insert(a->time().dateTime(), new AlarmScheduleItem(event, a, getAkonadiConfiguration(), this));
                                    ^~~~~~~~
                                    QDateTime
  make[2]: *** [plugins/Commands/Akonadi/CMakeFiles/simonakonadicommandplugin.dir/build.make:75: plugins/Commands/Akonadi/CMakeFiles/simonakonadicommandplugin.dir/akonadicommandmanager.cpp.o] Error 1
  make[1]: *** [CMakeFiles/Makefile2:6728: plugins/Commands/Akonadi/CMakeFiles/simonakonadicommandplugin.dir/all] Error 2
  make: *** [Makefile:163: all] Error 2
  ==> ERREUR : Une erreur s’est produite dans build().
      Abandon…
  Error making: simon-kf5-git

nipsky commented on 2018-01-15 11:06

Hi, is anyone using this successfully? Got it to install but I’m having a hard time getting the actual software to work…

lsf commented on 2017-09-22 13:20

Not to sound too harsh, but that PKBUILD was horrible: su, writing to my system during build, empty package as a result..

Anyway, I tried to improve it a bit, it now even builds in a clean chroot:

https://gist.github.com/lsfxz/e9accb3443d38222e2e922182757a984

I still get errors about opening the databse (out of memory errors) when actually trying to run simon, but that might be something you might know more about.

davvore33 commented on 2017-09-15 15:39

not sure about dep, just complain under here