Package Details: softethervpn-git v4.22.9634.beta-1

Git Clone URL: (read-only, click to copy)
Package Base: softethervpn-git
Description: Multi-protocol VPN software from University of Tsukuba
Upstream URL:
Keywords: vpn
Licenses: GPL2
Submitter: mytbk
Maintainer: bm456
Last Packager: bm456
Votes: 30
Popularity: 0.000000
First Submitted: 2014-01-08 01:43
Last Updated: 2017-11-28 01:54

Latest Comments

1 2 3 4 Next › Last »

ava1ar commented on 2017-11-19 05:28

I am not using it anymore and decided to disown the package.

tatac1 commented on 2017-10-08 22:08

I have fixed compile errors and upload changed files following URL.

wilbowma commented on 2017-07-07 02:02

This appears to need the same changes as the softehtervpn package to fix compatibility with openssl.

ava1ar commented on 2017-02-22 04:41

The src1sum was correct, but the updated patch was missing. Sorry.

Megatonna commented on 2017-02-21 14:13

sha1sum -t disable_client_sslv3.patch

ava1ar commented on 2017-02-20 16:29

Checksum is correct:
1533e7ba63ad7a9f2948af44d8a41c0cbe205307 disable_client_sslv3.patch
Perform clean checkout and try again.

jvybihal commented on 2017-02-20 12:15

@ava1ar please update sha1sum od the disable_client_sslv3.patch

==> Validating source files with sha1sums...
softethervpn-bridge.service ... Passed
softethervpn-client.service ... Passed
softethervpn-server.service ... Passed
disable_client_sslv3.patch ... FAILED

ava1ar commented on 2017-02-17 22:08

Package updated.

aixki, thanks for the updated patch!

aixki commented on 2017-01-18 16:23

I've managed to build it by creating a new patch that matches correctly the line numbers. I've also removed the configure_server_ssl_tls.patch which seems to break the build.

Here the new patch :

attenuation commented on 2016-12-27 13:06

build error
patching file src/Mayaqua/Network.c
Hunk #1 FAILED at 12981.
1 out of 1 hunk FAILED -- saving rejects to file src/Mayaqua/Network.c.rej