Package Details: sqsh 2.5.16.1-3

Git Clone URL: https://aur.archlinux.org/sqsh.git (read-only)
Package Base: sqsh
Description: Unix/Linux replacement for Sybase's isql
Upstream URL: http://www.sqsh.org/
Licenses: GPL
Submitter: None
Maintainer: terminalmage
Last Packager: terminalmage
Votes: 8
Popularity: 0.177102
First Submitted: 2008-07-15 18:41
Last Updated: 2017-01-12 17:52

Latest Comments

tkel commented on 2017-02-26 00:55

Great job on this. Thank you terminalimage!

terminalmage commented on 2017-01-12 17:57

Sorry, this took some effort to track down. The issue wasn't with readline, but rather with freetds. To get it to build, I had to build a patched freetds which includes a symbol which freetds appears to have removed in newer releases. I've just submitted the patched freetds to the AUR here: https://aur.archlinux.org/packages/freetds-patched-enum/

Let me know if this works for you, I no longer have a MSSQL database handy to test sqsh.

terminalmage commented on 2016-12-01 08:02

Sorry for the delay, I'll try to get this updated in the next couple days.

mayweed commented on 2016-12-01 07:42

Hello
@terminalmage: it does not work with new readline anymore...I try to rebuild it from the package and get that error:

gcc -march=i686 -mtune=generic -O2 -pipe -fstack-protector-strong -DSQSH_RC='"/etc/sqshrc:${HOME}/.sqshrc"' -DUSE_READLINE -DUSE_X11 -I/usr/include -D_FORTIFY_SOURCE=2 -c -o cmd_connect.o cmd_connect.c
cmd_connect.c: In function ‘cmd_connect’:
cmd_connect.c:864:23: error: ‘CS_TDS_80’ undeclared (first use in this function)
version = CS_TDS_80;
^~~~~~~~~
cmd_connect.c:864:23: note: each undeclared identifier is reported only once for each function it appears in
make[1]: *** [<builtin>: cmd_connect.o] Error 1
make[1]: Leaving directory '/home/.../Desktop/sqsh/src/sqsh-2.5/src'
make: *** [Makefile:34: build-subdirs] Error 2
==> ERROR: A failure occurred in build().
Aborting...

tkel commented on 2016-11-15 20:52

This no longer works with readline 7.0.

terminalmage commented on 2016-02-10 04:05

Thanks, I've updated the PKGBUILD.

tkel commented on 2016-02-09 21:37

Doesn't build:

==> ERROR: license should be an array

terminalmage commented on 2015-04-21 22:14

Whoops, thanks for catching that. I've also updated the version.

lykwydchykyn commented on 2015-04-21 21:22

There seems to be an error in the "arch=" line of the PKGBUILD.

It currently reads:
arch=('x86_64 i686')

It should read:
arch=('x86_64' 'i686')

This change was necessary for it to compile on my system using pacaur.

terminalmage commented on 2014-04-02 18:36

Great, thanks for confirming!

All comments