Package Details: ssb-patchwork-git 3.10.1.r301.g9750bc4d-1

Git Clone URL: https://aur.archlinux.org/ssb-patchwork-git.git (read-only, click to copy)
Package Base: ssb-patchwork-git
Description: A decentralized messaging and sharing app built on top of Secure Scuttlebutt (SSB)
Upstream URL: https://github.com/ssbc/patchwork
Licenses: AGPL3
Conflicts: ssb-patchwork
Provides: ssb-patchwork=3.10.1.r301.g9750bc4d
Submitter: christianbundy
Maintainer: christianbundy
Last Packager: christianbundy
Votes: 2
Popularity: 0.000000
First Submitted: 2018-07-25 02:13
Last Updated: 2019-02-13 17:20

Latest Comments

Tio commented on 2020-03-15 20:47

Error:


Preparing...
Cloning ssb-patchwork-git build files...
Checking ssb-patchwork-git dependencies...
Resolving dependencies...
Checking inter-conflicts...

Building ssb-patchwork-git...
==> Making package: ssb-patchwork-git 3.17.5.r4.ga3b0d928-1 (Sun 15 Mar 2020 09:46:32 PM CET)
==> Checking runtime dependencies...
==> Checking buildtime dependencies...
==> Retrieving sources...
  -> Updating patchwork git repo...
Fetching origin
From https://github.com/ssbc/patchwork
 - [deleted]           (none)     -> refs/pull/1070/merge
 - [deleted]           (none)     -> refs/pull/1079/merge
 - [deleted]           (none)     -> refs/pull/1251/merge
 - [deleted]           (none)     -> refs/pull/1259/merge
 - [deleted]           (none)     -> refs/pull/985/merge
 - [deleted]           (none)     -> refs/pull/990/merge
 * [new branch]        dependabot/npm_and_yarn/acorn-7.1.1 -> dependabot/npm_and_yarn/acorn-7.1.1
   a3b0d928..6ca9ebe0  master               -> master
 * [new ref]           refs/pull/1262/head  -> refs/pull/1262/head
 * [new ref]           refs/pull/1262/merge -> refs/pull/1262/merge
 * [new ref]           refs/pull/1265/head  -> refs/pull/1265/head
 * [new ref]           refs/pull/1265/merge -> refs/pull/1265/merge
 * [new ref]           refs/pull/1266/head  -> refs/pull/1266/head
 * [new ref]           refs/pull/1266/merge -> refs/pull/1266/merge
 * [new tag]           v3.17.6              -> v3.17.6
  -> Found run.sh
  -> Found ssb-patchwork.desktop
==> Validating source files with sha512sums...
    patchwork ... Skipped
    run.sh ... Passed
    ssb-patchwork.desktop ... Passed
==> Removing existing $srcdir/ directory...
==> Extracting sources...
  -> Creating working copy of patchwork git repo...
Cloning into 'patchwork'...
done.
==> Starting pkgver()...
==> Updated version: ssb-patchwork-git 3.17.6.r0.g6ca9ebe0-1
==> Removing existing $pkgdir/ directory...
==> Starting build()...

> @felixrieseberg/spellchecker@4.0.12 install /var/tmp/pamac-build-tio/ssb-patchwork-git/src/patchwork/node_modules/@felixrieseberg/spellchecker
> node-gyp rebuild

make: Entering directory '/var/tmp/pamac-build-tio/ssb-patchwork-git/src/patchwork/node_modules/@felixrieseberg/spellchecker/build'
  CXX(target) Release/obj.target/hunspell/vendor/hunspell/src/base/md5.o
  CXX(target) Release/obj.target/hunspell/vendor/hunspell/src/base/strings/string_piece.o
  CXX(target) Release/obj.target/hunspell/vendor/hunspell/src/google/bdict_reader.o
  CXX(target) Release/obj.target/hunspell/vendor/hunspell/src/google/bdict.o
  CXX(target) Release/obj.target/hunspell/vendor/hunspell/src/hunspell/affentry.o
  CXX(target) Release/obj.target/hunspell/vendor/hunspell/src/hunspell/affixmgr.o
  CXX(target) Release/obj.target/hunspell/vendor/hunspell/src/hunspell/csutil.o
  CXX(target) Release/obj.target/hunspell/vendor/hunspell/src/hunspell/dictmgr.o
  CXX(target) Release/obj.target/hunspell/vendor/hunspell/src/hunspell/filemgr.o
../vendor/hunspell/src/hunspell/dictmgr.cxx: In member function ‘int DictMgr::parse_file(const char*, const char*)’:
../vendor/hunspell/src/hunspell/dictmgr.cxx:102:37: warning: this statement may fall through [-Wimplicit-fallthrough=]
  102 |                        pdict->region=NULL;
      |                                     ^
../vendor/hunspell/src/hunspell/dictmgr.cxx:103:21: note: here
  103 |                     case 2: //deliberate fallthrough
      |                     ^~~~
  CXX(target) Release/obj.target/hunspell/vendor/hunspell/src/hunspell/hashmgr.o
../vendor/hunspell/src/google/bdict_reader.cc: In member function ‘bool hunspell::LineIterator::AdvanceAndCopy(char*, size_t)’:
../vendor/hunspell/src/google/bdict_reader.cc:670:15: warning: unused variable ‘begin’ [-Wunused-variable]
  670 |   const char* begin = reinterpret_cast<const char*>(&bdict_data_[cur_offset_]);
      |               ^~~~~
In file included from ../vendor/hunspell/src/hunspell/affixmgr.cxx:12:
../vendor/hunspell/src/hunspell/affentry.hxx:30:105: warning: converting to non-pointer type ‘short unsigned int’ from NULL [-Wconversion-null]
   30 |   struct hentry *      check_twosfx(const char * word, int len, char in_compound, const FLAG needflag = NULL);
      |                                                                                                         ^~~~
../vendor/hunspell/src/hunspell/affentry.hxx:93:114: warning: converting to non-pointer type ‘short unsigned int’ from NULL [-Wconversion-null]
   93 |   struct hentry *   check_twosfx(const char * word, int len, int optflags, PfxEntry* ppfx, const FLAG needflag = NULL);
      |                                                                                                                  ^~~~
  CXX(target) Release/obj.target/hunspell/vendor/hunspell/src/hunspell/hunspell.o
  CXX(target) Release/obj.target/hunspell/vendor/hunspell/src/hunspell/hunzip.o
In file included from ../vendor/hunspell/src/hunspell/affentry.cxx:9:
../vendor/hunspell/src/hunspell/affentry.hxx:30:105: warning: converting to non-pointer type ‘short unsigned int’ from NULL [-Wconversion-null]
   30 |   struct hentry *      check_twosfx(const char * word, int len, char in_compound, const FLAG needflag = NULL);
      |                                                                                                         ^~~~
../vendor/hunspell/src/hunspell/affentry.hxx:93:114: warning: converting to non-pointer type ‘short unsigned int’ from NULL [-Wconversion-null]
   93 |   struct hentry *   check_twosfx(const char * word, int len, int optflags, PfxEntry* ppfx, const FLAG needflag = NULL);
      |                                                                                                                  ^~~~
  CXX(target) Release/obj.target/hunspell/vendor/hunspell/src/hunspell/phonet.o
../vendor/hunspell/src/hunspell/affentry.cxx: In member function ‘int PfxEntry::test_condition(const char*)’:
../vendor/hunspell/src/hunspell/affentry.cxx:113:20: warning: this statement may fall through [-Wimplicit-fallthrough=]
  113 |          case '.': if (!pos) { // dots are not metacharacters in groups: [.]
      |                    ^~
../vendor/hunspell/src/hunspell/affentry.cxx:120:5: note: here
  120 |     default: {
      |     ^~~~~~~
../vendor/hunspell/src/hunspell/affentry.cxx: In member function ‘int SfxEntry::test_condition(const char*, const char*)’:
../vendor/hunspell/src/hunspell/affentry.cxx:503:19: warning: this statement may fall through [-Wimplicit-fallthrough=]
  503 |         case '.': if (!pos) { // dots are not metacharacters in groups: [.]
      |                   ^~
../vendor/hunspell/src/hunspell/affentry.cxx:518:5: note: here
  518 |     default: {
      |     ^~~~~~~
In file included from /usr/include/string.h:495,
                 from ../vendor/hunspell/src/hunspell/affixmgr.cxx:5:
In function ‘char* strncpy(char*, const char*, size_t)’,
    inlined from ‘int AffixMgr::encodeit(affentry&, char*)’ at ../vendor/hunspell/src/hunspell/affixmgr.cxx:1141:12:
/usr/include/bits/string_fortified.h:106:34: warning: ‘char* __builtin_strncpy(char*, const char*, long unsigned int)’ specified bound 20 equals destination size [-Wstringop-truncation]
  106 |   return __builtin___strncpy_chk (__dest, __src, __len, __bos (__dest));
      |          ~~~~~~~~~~~~~~~~~~~~~~~~^~~~~~~~~~~~~~~~~~~~~~~~~~~~~~~~~~~~~~
In file included from /usr/include/string.h:495,
                 from ../vendor/hunspell/src/hunspell/csutil.cxx:5:
In function ‘char* strncpy(char*, const char*, size_t)’,
    inlined from ‘void strlinecat(char*, const char*)’ at ../vendor/hunspell/src/hunspell/csutil.cxx:411:24:
/usr/include/bits/string_fortified.h:106:34: warning: ‘char* __builtin_strncpy(char*, const char*, long unsigned int)’ output truncated before terminating nul copying as many bytes from a string as its length [-Wstringop-truncation]
  106 |   return __builtin___strncpy_chk (__dest, __src, __len, __bos (__dest));
      |          ~~~~~~~~~~~~~~~~~~~~~~~~^~~~~~~~~~~~~~~~~~~~~~~~~~~~~~~~~~~~~~
../vendor/hunspell/src/hunspell/csutil.cxx: In function ‘void strlinecat(char*, const char*)’:
../vendor/hunspell/src/hunspell/csutil.cxx:407:21: note: length computed here
  407 |     int len = strlen(s);
      |               ~~~~~~^~~
  CXX(target) Release/obj.target/hunspell/vendor/hunspell/src/hunspell/replist.o
  CXX(target) Release/obj.target/hunspell/vendor/hunspell/src/hunspell/suggestmgr.o
../vendor/hunspell/src/hunspell/hunspell.cxx: In member function ‘int Hunspell::spell(const char*, int*, char**)’:
../vendor/hunspell/src/hunspell/hunspell.cxx:404:19: warning: this statement may fall through [-Wimplicit-fallthrough=]
  404 |             *info += SPELL_ORIGCAP;
../vendor/hunspell/src/hunspell/hunspell.cxx:405:6: note: here
  405 |      case NOCAP: {
      |      ^~~~
../vendor/hunspell/src/hunspell/hunspell.cxx:474:13: warning: this statement may fall through [-Wimplicit-fallthrough=]
  474 |             }
      |             ^
../vendor/hunspell/src/hunspell/hunspell.cxx:476:6: note: here
  476 |      case INITCAP: {
      |      ^~~~
../vendor/hunspell/src/hunspell/hunspell.cxx: In member function ‘int Hunspell::suggest(char***, const char*)’:
../vendor/hunspell/src/hunspell/hunspell.cxx:786:30: warning: this statement may fall through [-Wimplicit-fallthrough=]
  786 |                     capwords = 1;
      |                     ~~~~~~~~~^~~
../vendor/hunspell/src/hunspell/hunspell.cxx:787:6: note: here
  787 |      case HUHCAP: {
      |      ^~~~
../vendor/hunspell/src/hunspell/hunspell.cxx:910:24: warning: this statement may fall through [-Wimplicit-fallthrough=]
  910 |               capwords = 1;
      |               ~~~~~~~~~^~~
../vendor/hunspell/src/hunspell/hunspell.cxx:911:11: note: here
  911 |           case HUHCAP: {
      |           ^~~~
In file included from /usr/include/string.h:495,
                 from ../vendor/hunspell/src/hunspell/csutil.cxx:5:
In function ‘char* strncpy(char*, const char*, size_t)’,
    inlined from ‘char* mystrrep(char*, const char*, const char*)’ at ../vendor/hunspell/src/hunspell/csutil.cxx:567:16:
/usr/include/bits/string_fortified.h:106:34: warning: ‘char* __builtin_strncpy(char*, const char*, long unsigned int)’ output truncated before terminating nul copying as many bytes from a string as its length [-Wstringop-truncation]
  106 |   return __builtin___strncpy_chk (__dest, __src, __len, __bos (__dest));
      |          ~~~~~~~~~~~~~~~~~~~~~~~~^~~~~~~~~~~~~~~~~~~~~~~~~~~~~~~~~~~~~~
../vendor/hunspell/src/hunspell/csutil.cxx: In function ‘char* mystrrep(char*, const char*, const char*)’:
../vendor/hunspell/src/hunspell/csutil.cxx:552:26: note: length computed here
  552 |       int replen = strlen(rep);
      |                    ~~~~~~^~~~~
  CXX(target) Release/obj.target/hunspell/vendor/hunspell/src/parsers/textparser.o
  CXX(target) Release/obj.target/hunspell/vendor/hunspell/src/base/strings/string16.o
In file included from /usr/include/string.h:495,
                 from ../vendor/hunspell/src/hunspell/suggestmgr.cxx:5:
In function ‘char* strncpy(char*, const char*, size_t)’,
    inlined from ‘char* SuggestMgr::suggest_gen(char**, int, char*)’ at ../vendor/hunspell/src/hunspell/suggestmgr.cxx:1883:12:
/usr/include/bits/string_fortified.h:106:34: warning: ‘char* __builtin_strncpy(char*, const char*, long unsigned int)’ output truncated before terminating nul copying 3 bytes from a string of the same length [-Wstringop-truncation]
  106 |   return __builtin___strncpy_chk (__dest, __src, __len, __bos (__dest));
      |          ~~~~~~~~~~~~~~~~~~~~~~~~^~~~~~~~~~~~~~~~~~~~~~~~~~~~~~~~~~~~~~
  AR(target) Release/obj.target/hunspell.a
  COPY Release/hunspell.a
  CXX(target) Release/obj.target/spellchecker/src/main.o
  CXX(target) Release/obj.target/spellchecker/src/spellchecker_hunspell.o
  CXX(target) Release/obj.target/spellchecker/src/spellchecker_linux.o
  CXX(target) Release/obj.target/spellchecker/src/transcoder_posix.o
In file included from /home/tio/.cache/node-gyp/iojs-2.0.18/src/node.h:63,
                 from ../../../nan/nan.h:54,
                 from ../src/main.cc:2:
/home/tio/.cache/node-gyp/iojs-2.0.18/deps/v8/include/v8.h: In static member function ‘static void v8::V8::SetAllowCodeGenerationFromStringsCallback(v8::DeprecatedAllowCodeGenerationFromStringsCallback)’:
/home/tio/.cache/node-gyp/iojs-2.0.18/deps/v8/include/v8.h:10176:19: warning: cast between incompatible function types from ‘v8::DeprecatedAllowCodeGenerationFromStringsCallback’ {aka ‘bool (*)(v8::Local<v8::Context>)’} to ‘v8::FreshNewAllowCodeGenerationFromStringsCallback’ {aka ‘bool (*)(v8::Local<v8::Context>, v8::Local<v8::String>)’} [-Wcast-function-type]
10176 |           callback));
      |                   ^
/home/tio/.cache/node-gyp/iojs-2.0.18/deps/v8/include/v8.h: In static member function ‘static void v8::V8::RemoveGCPrologueCallback(v8::GCCallback)’:
/home/tio/.cache/node-gyp/iojs-2.0.18/deps/v8/include/v8.h:10221:53: warning: cast between incompatible function types from ‘v8::GCCallback’ {aka ‘void (*)(v8::GCType, v8::GCCallbackFlags)’} to ‘v8::Isolate::GCCallback’ {aka ‘void (*)(v8::Isolate*, v8::GCType, v8::GCCallbackFlags)’} [-Wcast-function-type]
10221 |       reinterpret_cast<Isolate::GCCallback>(callback));
      |                                                     ^
/home/tio/.cache/node-gyp/iojs-2.0.18/deps/v8/include/v8.h: In static member function ‘static void v8::V8::RemoveGCEpilogueCallback(v8::GCCallback)’:
/home/tio/.cache/node-gyp/iojs-2.0.18/deps/v8/include/v8.h:10228:53: warning: cast between incompatible function types from ‘v8::GCCallback’ {aka ‘void (*)(v8::GCType, v8::GCCallbackFlags)’} to ‘v8::Isolate::GCCallback’ {aka ‘void (*)(v8::Isolate*, v8::GCType, v8::GCCallbackFlags)’} [-Wcast-function-type]
10228 |       reinterpret_cast<Isolate::GCCallback>(callback));
      |                                                     ^
In file included from ../src/main.cc:2:
../../../nan/nan.h: In function ‘void Nan::AsyncQueueWorker(Nan::AsyncWorker*)’:
../../../nan/nan.h:2298:62: warning: cast between incompatible function types from ‘void (*)(uv_work_t*)’ {aka ‘void (*)(uv_work_s*)’} to ‘uv_after_work_cb’ {aka ‘void (*)(uv_work_s*, int)’} [-Wcast-function-type]
 2298 |     , reinterpret_cast<uv_after_work_cb>(AsyncExecuteComplete)
      |                                                              ^
../src/main.cc: In static member function ‘static Nan::NAN_METHOD_RETURN_TYPE {anonymous}::Spellchecker::CheckSpelling(Nan::NAN_METHOD_ARGS_TYPE)’:
../src/main.cc:93:34: error: cannot convert ‘v8::Isolate*’ to ‘uint16_t*’ {aka ‘short unsigned int*’}
   93 |     string->Write(info.GetIsolate(), reinterpret_cast<uint16_t *>(text.data()));
      |                   ~~~~~~~~~~~~~~~^~
      |                                  |
      |                                  v8::Isolate*
In file included from /home/tio/.cache/node-gyp/iojs-2.0.18/src/node.h:63,
                 from ../../../nan/nan.h:54,
                 from ../src/main.cc:2:
/home/tio/.cache/node-gyp/iojs-2.0.18/deps/v8/include/v8.h:2515:23: note:   initializing argument 1 of ‘int v8::String::Write(uint16_t*, int, int, int) const’
 2515 |   int Write(uint16_t* buffer,
      |             ~~~~~~~~~~^~~~~~
In file included from ../../../nan/nan.h:54,
                 from ../src/main.cc:2:
../src/main.cc: At global scope:
/home/tio/.cache/node-gyp/iojs-2.0.18/src/node.h:492:43: warning: cast between incompatible function types from ‘void (*)(v8::Local<v8::Object>, v8::Local<v8::Object>)’ to ‘node::addon_register_func’ {aka ‘void (*)(v8::Local<v8::Object>, v8::Local<v8::Value>, void*)’} [-Wcast-function-type]
  492 |       (node::addon_register_func) (regfunc),                          \
      |                                           ^
/home/tio/.cache/node-gyp/iojs-2.0.18/src/node.h:523:3: note: in expansion of macro ‘NODE_MODULE_X’
  523 |   NODE_MODULE_X(modname, regfunc, NULL, 0)
      |   ^~~~~~~~~~~~~
../src/main.cc:228:1: note: in expansion of macro ‘NODE_MODULE’
  228 | NODE_MODULE(spellchecker, Init)
      | ^~~~~~~~~~~
In file included from /home/tio/.cache/node-gyp/iojs-2.0.18/src/node.h:63,
                 from ../../../nan/nan.h:54,
                 from ../src/main.cc:2:
/home/tio/.cache/node-gyp/iojs-2.0.18/deps/v8/include/v8.h: In instantiation of ‘void v8::PersistentBase<T>::SetWeak(P*, typename v8::WeakCallbackInfo<P>::Callback, v8::WeakCallbackType) [with P = node::ObjectWrap; T = v8::Object; typename v8::WeakCallbackInfo<P>::Callback = void (*)(const v8::WeakCallbackInfo<node::ObjectWrap>&)]’:
/home/tio/.cache/node-gyp/iojs-2.0.18/src/node_object_wrap.h:85:78:   required from here
/home/tio/.cache/node-gyp/iojs-2.0.18/deps/v8/include/v8.h:9199:16: warning: cast between incompatible function types from ‘v8::WeakCallbackInfo<node::ObjectWrap>::Callback’ {aka ‘void (*)(const v8::WeakCallbackInfo<node::ObjectWrap>&)’} to ‘Callback’ {aka ‘void (*)(const v8::WeakCallbackInfo<void>&)’} [-Wcast-function-type]
 9199 |                reinterpret_cast<Callback>(callback), type);
      |                ^~~~~~~~~~~~~~~~~~~~~~~~~~~~~~~~~~~~
/home/tio/.cache/node-gyp/iojs-2.0.18/deps/v8/include/v8.h: In instantiation of ‘void v8::PersistentBase<T>::SetWeak(P*, typename v8::WeakCallbackInfo<P>::Callback, v8::WeakCallbackType) [with P = Nan::ObjectWrap; T = v8::Object; typename v8::WeakCallbackInfo<P>::Callback = void (*)(const v8::WeakCallbackInfo<Nan::ObjectWrap>&)]’:
../../../nan/nan_object_wrap.h:65:61:   required from here
/home/tio/.cache/node-gyp/iojs-2.0.18/deps/v8/include/v8.h:9199:16: warning: cast between incompatible function types from ‘v8::WeakCallbackInfo<Nan::ObjectWrap>::Callback’ {aka ‘void (*)(const v8::WeakCallbackInfo<Nan::ObjectWrap>&)’} to ‘Callback’ {aka ‘void (*)(const v8::WeakCallbackInfo<void>&)’} [-Wcast-function-type]
make: *** [spellchecker.target.mk:117: Release/obj.target/spellchecker/src/main.o] Error 1
make: *** Waiting for unfinished jobs....
make: Leaving directory '/var/tmp/pamac-build-tio/ssb-patchwork-git/src/patchwork/node_modules/@felixrieseberg/spellchecker/build'
gyp ERR! build error 
gyp ERR! stack Error: `make` failed with exit code: 2
gyp ERR! stack     at ChildProcess.onExit (/usr/lib/node_modules/node-gyp/lib/build.js:194:23)
gyp ERR! stack     at ChildProcess.emit (events.js:311:20)
gyp ERR! stack     at Process.ChildProcess._handle.onexit (internal/child_process.js:275:12)
gyp ERR! System Linux 5.4.24-1-MANJARO
gyp ERR! command "/usr/bin/node" "/usr/lib/node_modules/node-gyp/bin/node-gyp.js" "rebuild"
gyp ERR! cwd /var/tmp/pamac-build-tio/ssb-patchwork-git/src/patchwork/node_modules/@felixrieseberg/spellchecker
gyp ERR! node -v v12.16.1
gyp ERR! node-gyp -v v6.1.0
gyp ERR! not ok 
npm ERR! code ELIFECYCLE
npm ERR! errno 1
npm ERR! @felixrieseberg/spellchecker@4.0.12 install: `node-gyp rebuild`
npm ERR! Exit status 1
npm ERR! 
npm ERR! Failed at the @felixrieseberg/spellchecker@4.0.12 install script.
npm ERR! This is probably not a problem with npm. There is likely additional logging output above.

npm ERR! A complete log of this run can be found in:
npm ERR!     /home/tio/.npm/_logs/2020-03-15T20_46_58_970Z-debug.log
==> ERROR: A failure occurred in build().
    Aborting...

beroal commented on 2019-06-04 17:36

I cannot compile this.

==> Making package: ssb-patchwork-git 3.10.1.r301.g9750bc4d-1 (Tue 04 Jun 2019 08:34:47 PM EEST)
==> Checking runtime dependencies...
==> Checking buildtime dependencies...
==> Retrieving sources...
  -> Updating patchwork git repo...
Fetching origin
  -> Found run.sh
  -> Found ssb-patchwork.desktop
==> Validating source files with sha512sums...
    patchwork ... Skipped
    run.sh ... Passed
    ssb-patchwork.desktop ... Passed
==> Extracting sources...
  -> Creating working copy of patchwork git repo...
Reset branch 'makepkg'
==> Starting pkgver()...
==> Updated version: ssb-patchwork-git 3.12.0.r3.g88893c97-1
==> Removing existing $pkgdir/ directory...
==> Starting build()...

(electron2:1344): Gtk-WARNING **: 20:34:48.765: cannot open display:

> @felixrieseberg/spellchecker@4.0.8 install /var/abs/local/ssb-patchwork-git/src/patchwork/node_modules/@felixrieseberg/spellchecker > node-gyp rebuild

gyp WARN install got an error, rolling back install gyp ERR! configure error gyp ERR! stack Error: 404 response downloading https://atom.io/download/electron/v11.15.0/node-v11.15.0-headers.tar.gz gyp ERR! stack at Request.<anonymous> (/usr/lib/node_modules/node-gyp/lib/install.js:204:14) gyp ERR! stack at Request.emit (events.js:198:15) gyp ERR! stack at Request.onRequestResponse (/usr/lib/node_modules/node-gyp/node_modules/request/request.js:1066:10) gyp ERR! stack at ClientRequest.emit (events.js:193:13) gyp ERR! stack at HTTPParser.parserOnIncomingClient [as onIncoming] (_http_client.js:560:23) gyp ERR! stack at HTTPParser.parserOnHeadersComplete (_http_common.js:113:17) gyp ERR! stack at TLSSocket.socketOnData (_http_client.js:447:22) gyp ERR! stack at TLSSocket.emit (events.js:193:13) gyp ERR! stack at addChunk (_stream_readable.js:295:12) gyp ERR! stack at readableAddChunk (_stream_readable.js:276:11) gyp ERR! System Linux 5.1.6-arch1-1-ARCH gyp ERR! command "/usr/bin/node" "/usr/lib/node_modules/node-gyp/bin/node-gyp.js" "rebuild" gyp ERR! cwd /var/abs/local/ssb-patchwork-git/src/patchwork/node_modules/@felixrieseberg/spellchecker gyp ERR! node -v v11.15.0 gyp ERR! node-gyp -v v4.0.0 gyp ERR! not ok npm WARN acorn-dynamic-import@4.0.0 requires a peer of acorn@^6.0.0 but none is installed. You must install peer dependencies yourself. npm WARN acorn-jsx@5.0.1 requires a peer of acorn@^6.0.0 but none is installed. You must install peer dependencies yourself. npm WARN optional SKIPPING OPTIONAL DEPENDENCY: fsevents@1.2.9 (node_modules/fsevents): npm WARN notsup SKIPPING OPTIONAL DEPENDENCY: Unsupported platform for fsevents@1.2.9: wanted {"os":"darwin","arch":"any"} (current: {"os":"linux","arch":"x64"})

npm ERR! code ELIFECYCLE npm ERR! errno 1 npm ERR! @felixrieseberg/spellchecker@4.0.8 install: node-gyp rebuild npm ERR! Exit status 1 npm ERR! npm ERR! Failed at the @felixrieseberg/spellchecker@4.0.8 install script. npm ERR! This is probably not a problem with npm. There is likely additional logging output above.

npm ERR! A complete log of this run can be found in: npm ERR! /home/compile/.npm/_logs/2019-06-04T17_34_55_801Z-debug.log ==> ERROR: A failure occurred in build(). Aborting...

Tav commented on 2019-04-12 16:30

Probably something simple. What executes the package once it is installed? I've tried several variations on the package name, but so far, no dice.

edit. Nevermind. I found it. Apparently electron wasn't installed which I suppose should be added as a required package to this build?

christianbundy commented on 2019-02-13 15:49

Please don't flag this package as out-of-date. It's a VCS package0 and the AUR only shows the last time that it was manually updated. When you download the package it will always install the latest version. If you're having trouble with the package, please leave a comment! I'm happy to help. :)