Package Details: steadyflow 0.2.0-4

Git Clone URL: https://aur.archlinux.org/steadyflow.git (read-only)
Package Base: steadyflow
Description: A download manager that aims for minimalism, ease of use, and a clean, malleable codebase
Upstream URL: https://launchpad.net/steadyflow
Licenses: GPL3
Conflicts: steadyflow-bzr
Submitter: zbito
Maintainer: M0Rf30
Last Packager: M0Rf30
Votes: 12
Popularity: 0.000082
First Submitted: 2010-09-18 15:22
Last Updated: 2015-06-17 14:32

Latest Comments

iskenderoguz commented on 2016-09-13 02:40

0.2.0 error :

/tmp/yaourt-tmp-ekcdr/aur-steadyflow/src/steadyflow-0.2.0/Steadyflow/FileListController.vala:30.10-30.18: error: `ListStore' is an ambiguous reference between `GLib.ListStore' and `Gtk.ListStore'
private ListStore model;
^^^^^^^^^
Compilation failed: 1 error(s), 4 warning(s)
make[2]: *** [CMakeFiles/steadyflow.dir/build.make:87: Steadyflow.Core/DownloadService.c] Error 1
make[1]: *** [CMakeFiles/Makefile2:67: CMakeFiles/steadyflow.dir/all] Error 2
make: *** [Makefile:128: all] Error 2

moridori commented on 2016-05-17 09:06

0.18: error: `ListStore' is an ambiguous reference between `GLib.ListStore' and `Gtk.ListStore'
private ListStore model;
^^^^^^^^^
Compilation failed: 1 error(s), 4 warning(s)
CMakeFiles/steadyflow.dir/build.make:86: recipe for target 'Steadyflow.Core/DownloadService.c' failed
make[2]: *** [Steadyflow.Core/DownloadService.c] Error 1
CMakeFiles/Makefile2:67: recipe for target 'CMakeFiles/steadyflow.dir/all' failed
make[1]: *** [CMakeFiles/steadyflow.dir/all] Error 2
Makefile:127: recipe for target 'all' failed
make: *** [all] Error 2

cleocir commented on 2014-05-19 13:50

/tmp/yaourt-tmp-root/aur-steadyflow/src/steadyflow-0.2.0/Steadyflow/Services.vala:64.3-64.6: error: `exit' is an ambiguous reference between `GLib.Process.exit' and `Gtk.exit'
exit(1);
^^^^

cleocir commented on 2014-05-19 13:46

Compilation failed: 1 error(s), 20 warning(s)
CMakeFiles/steadyflow.dir/build.make:81: recipe for target 'Steadyflow.Core/DownloadService.c' failed
make[2]: *** [Steadyflow.Core/DownloadService.c] Error 1
CMakeFiles/Makefile2:63: recipe for target 'CMakeFiles/steadyflow.dir/all' failed
make[1]: *** [CMakeFiles/steadyflow.dir/all] Error 2
Makefile:116: recipe for target 'all' failed
make: *** [all] Error 2

k0Do commented on 2013-05-30 14:48

CMake Error at cmake/FindExtraDeps.cmake:11 (message):
libgee not found
Call Stack (most recent call first):
CMakeLists.txt:25 (find_package)

k0Do commented on 2013-05-30 14:46

libgee is missing in PKGBUILD as a required dependency

Barthalion commented on 2012-07-14 08:20

Of course you're right - fixed.

Jristz commented on 2012-07-09 17:07

sure that you need liunique and not libunique3 for wild a gtk3 package?

archtux commented on 2012-07-06 12:03

Proceed with installation? [Y/n] y
(1/1) checking package integrity [####################################################################] 100%
(1/1) loading package files [####################################################################] 100%
(1/1) checking for file conflicts [####################################################################] 100%
(1/1) upgrading steadyflow [####################################################################] 100%
usr/share/glib-2.0/schemas/net.launchpad.steadyflow.gschema.xml: Error on line 4 char 1: <enum id='finish-action'> already specified. This entire file has been ignored.

glib schemas not installed!

Anonymous comment on 2012-02-16 14:59

@dserban
There's a simple workaround: change all occurrences of ActionEntry into Gtk.ActionEntry in IndicatorController.vala

All comments