Package Details: subtitlecomposer 0.6.6-3

Git Clone URL: https://aur.archlinux.org/subtitlecomposer.git (read-only)
Package Base: subtitlecomposer
Description: A KDE subtitle editor
Upstream URL: https://github.com/maxrd2/subtitlecomposer
Keywords: composer editor kde subtitle
Licenses: GPL
Submitter: Martchus
Maintainer: Martchus (maxrd2)
Last Packager: Martchus
Votes: 20
Popularity: 0.051026
First Submitted: 2015-09-02 23:50
Last Updated: 2018-06-10 19:47

Pinned Comments

Martchus commented on 2016-05-18 21:59

All my packages are managed at GitHub where you can also contribute directly: https://github.com/Martchus/PKGBUILDs
There also exist a binary repository (i686 and x86_64, also contains Git version): https://martchus.no-ip.biz/repo/arch/ownstuff

Latest Comments

« First ‹ Previous 1 2 3

Martchus commented on 2015-11-07 22:43

I've just updated the package since the previous version didn't work when building for i686 architecture.

I hope this fixes your issue, but I can't say it exactly, because the error message you've provided misses the interesting part. But I guess before "compilation terminated." you've got:
"In file included from /usr/include/gstreamer-1.0/gst/gstbin.h:27:0,
from /usr/include/gstreamer-1.0/gst/gst.h:35,
from /build/subtitlecomposer/src/subtitlecomposer-0.5.7/src/services/gstreamer/gstreamerplayerbackend.h:33,
from /build/subtitlecomposer/src/subtitlecomposer-0.5.7/src/services/player.cpp:24:
/usr/include/gstreamer-1.0/gst/gstelement.h:55:27: fatal error: gst/gstconfig.h: No such file or directory"

I use a workaround to prevent this error and as I sayed it should now also work for i686.

By the way, here's a link to my binary repository: http://martchus.netai.net/page.php?name=programming
(The link in the PKGBUILD file is from the maintainer in the old AUR but I think he doesn't update the repository very frequently.)

dare023 commented on 2015-11-07 19:56

Update fails:
compilation terminated.
src/services/tests/CMakeFiles/services-wavewritertest.dir/build.make:374: recipe for target 'src/services/tests/CMakeFiles/services-wavewritertest.dir/__/player.o' failed
make[2]: *** [src/services/tests/CMakeFiles/services-wavewritertest.dir/__/player.o] Error 1
CMakeFiles/Makefile2:1709: recipe for target 'src/services/tests/CMakeFiles/services-wavewritertest.dir/all' failed
make[1]: *** [src/services/tests/CMakeFiles/services-wavewritertest.dir/all] Error 2
Makefile:138: recipe for target 'all' failed
make: *** [all] Error 2