Package Details: sumo 0.32.0-1

Git Clone URL: (read-only)
Package Base: sumo
Description: Free and open traffic simulation suite which allows modelling of intermodal traffic systems including road vehicles, public transport and pedestrians.
Upstream URL:
Keywords: science simulation traffic
Licenses: GPL
Submitter: mareex
Maintainer: hdoebler
Last Packager: hdoebler
Votes: 6
Popularity: 0.000348
First Submitted: 2014-04-28 23:12
Last Updated: 2018-01-09 08:43

Dependencies (9)

Required by (0)

Sources (4)

Latest Comments

jerry73204 commented on 2017-10-16 11:50

I found adding !buildflags to options resolves the undefined reference issue.

Asfhy commented on 2017-04-22 17:06

As it seems to have something to do with GTEST_CONFIG and the unittest source folder, I tryed to add "--without-gtest-config" to the configure line at the build() method on the PKGBUILD file and it worked. So it seems like some dependency is missing and preventing the gtest-config to compile.

Asfhy commented on 2017-04-21 18:47

I can't get it to install (sumo). I checked and I have all depencies, even the optional ones. It downloads ok, pass the sum verification and starts to compile, but after some time compiling, I get an error and can't continue to install; here the last lines before the error:

GeoConvHelper.cpp:(.text+0x40b): undefined reference to `pj_init_plus'
../../src/utils/geom/libgeom.a(GeoConvHelper.o): In function `GeoConvHelper::operator=(GeoConvHelper const&)':
GeoConvHelper.cpp:(.text+0x601): undefined reference to `pj_free'
GeoConvHelper.cpp:(.text+0x617): undefined reference to `pj_free'
GeoConvHelper.cpp:(.text+0x62d): undefined reference to `pj_free'
GeoConvHelper.cpp:(.text+0x645): undefined reference to `pj_init_plus'
GeoConvHelper.cpp:(.text+0x659): undefined reference to `pj_get_def'
GeoConvHelper.cpp:(.text+0x661): undefined reference to `pj_init_plus'
GeoConvHelper.cpp:(.text+0x675): undefined reference to `pj_get_def'
GeoConvHelper.cpp:(.text+0x67d): undefined reference to `pj_init_plus'
../../src/utils/geom/libgeom.a(GeoConvHelper.o): In function `GeoConvHelper::cartesian2geo(Position&) const':
GeoConvHelper.cpp:(.text+0x1f3c): undefined reference to `pj_inv'
../../src/utils/geom/libgeom.a(GeoConvHelper.o): In function `GeoConvHelper::x2cartesian_const(Position&) const':
GeoConvHelper.cpp:(.text+0x31b9): undefined reference to `pj_fwd'
../../src/utils/geom/libgeom.a(GeoConvHelper.o): In function `GeoConvHelper::x2cartesian(Position&, bool)':
GeoConvHelper.cpp:(.text+0x35be): undefined reference to `pj_transform'
GeoConvHelper.cpp:(.text+0x3bb0): undefined reference to `pj_init_plus'
GeoConvHelper.cpp:(.text+0x631d): undefined reference to `pj_init_plus'
GeoConvHelper.cpp:(.text+0x632d): undefined reference to `pj_init_plus'
collect2: error: ld returned 1 exit status
make[3]: *** [Makefile:533: sumo-unittest] Error 1
make[3]: se sale del directorio '/tmp/pamac-build-asfhy/sumo/src/sumo-0.29.0/unittest/src'
make[2]: *** [Makefile:577: all-recursive] Error 1
make[2]: se sale del directorio '/tmp/pamac-build-asfhy/sumo/src/sumo-0.29.0/unittest/src'
make[1]: *** [Makefile:363: all-recursive] Error 1
make[1]: se sale del directorio '/tmp/pamac-build-asfhy/sumo/src/sumo-0.29.0/unittest'
make: *** [Makefile:393: all-recursive] Error 1

hdoebler commented on 2016-12-02 12:16


I am working with SUMO for quite a long time now and will continue to do so. So if you would like to disown it, I will be happy to step in as Maintainer.

FlorianJacob commented on 2016-08-01 14:02


Thanks, I adopted and updated the package to the current version now, but sourceforge mirror is down at the moment. :/ Everything should work now as soon as it's back up, though. :D

The lab course I needed sumo for is over now, though, so if anybody really uses sumo and wants to maintain this, I'll happily set you as Co-Maintainer or Main Maintainer. ;)

mareex commented on 2016-07-25 16:43


Hi, I do not have much time now to maintain this package. :(
I will disown it, so that somebody else can take care of it. :)

FlorianJacob commented on 2016-07-21 13:09

Just found out: The new version sumo 0.27.0 also needs the new dependencies "proj" and "gdal", without them it won't start.

mareex commented on 2015-09-25 08:21

Thanks for reporting. PKGBUILD is now corrected and updated silently.

dummy1 commented on 2015-09-25 01:09

Not building correctly; as of today (2015-09-25), for version 0.23, it is needed to change the url's in PKGBUILD from

dummy1 commented on 2015-09-25 01:08

Not building correctly; as of today (2015-09-25), for version 0.23, it is needed to change the url's in PKGBUILD from