Package Details: supermodel-svn 20170313.528-1

Git Clone URL: https://aur.archlinux.org/supermodel-svn.git (read-only)
Package Base: supermodel-svn
Description: A Sega Model 3 Arcade Emulator
Upstream URL: http://www.supermodel3.com/
Licenses: GPL3
Submitter: MarcinWieczorek
Maintainer: MarcinWieczorek
Last Packager: MarcinWieczorek
Votes: 2
Popularity: 0.010289
First Submitted: 2016-05-09 12:32
Last Updated: 2017-03-14 23:00

Latest Comments

klore commented on 2017-04-18 13:53

hello,

makefile for linux fixed since 599, i guess patch not need

r599
– Linux Makefile fixed by Sergio Benjamin

klore commented on 2017-04-12 19:06

hello I have trouble with patch, now in 540-1

==> Starting pkgver()...
==> Updated version: supermodel-svn 20170412.597-1
==> Starting build()...
patching file Src/OSD/SDL/Main.cpp
Reversed (or previously applied) patch detected! Assume -R? [n]

hello, in time to apply patching file Src/OSD/SDL/Main.cpp, patch detected! Assume -R? [n] , using y and n always error

Hunk #1 succeeded at 1197 with fuzz 2 (offset 685 lines).
Hunk #2 FAILED at 523.
Hunk #3 FAILED at 627.
Hunk #4 FAILED at 725.
Hunk #5 FAILED at 750.
Hunk #6 FAILED at 785.
Hunk #7 FAILED at 809.
6 out of 7 hunks FAILED -- saving rejects to file Src/OSD/SDL/Main.cpp.rej

thank you

klore commented on 2017-03-15 05:44

Hello, patch worked and now i can compile~
thank you

MarcinWieczorek commented on 2017-03-14 23:01

Thank you for reporting the problem. It should be solved in the project but I have applied a patch. I don't use the emulator, please contact the author if you have some time spare.

klore commented on 2017-03-14 20:03

Hello, having problem to compile since 492, similar new3d issue

New3D.cpp:(.text+0x1ebb): undefined reference to `New3D::R3DScrollFog::R3DScrollFog()'
obj/New3D.o: In function `New3D::CNew3D::~CNew3D()':
New3D.cpp:(.text+0x1fa0): undefined reference to `New3D::R3DScrollFog::~R3DScrollFog()'
obj/New3D.o: In function `New3D::CNew3D::DrawScrollFog()':
New3D.cpp:(.text+0x1f0): undefined reference to `New3D::R3DScrollFog::DrawScrollFog(float, float, float, float)'
collect2: error: ld returned 1 exit status
make: *** [Makefiles/Makefile.SDL.UNIX.GCC:129: all] Error 1

thank you for put aur supermodel