Package Details: svxlink 17.12-1

Git Clone URL: https://aur.archlinux.org/svxlink.git (read-only)
Package Base: svxlink
Description: Echolink Software to provide Ham Radio Voip Operations
Upstream URL: http://sourceforge.net/projects/svxlink/
Licenses: GPL
Submitter: hardfalcon
Maintainer: CarstenF
Last Packager: CarstenF
Votes: 9
Popularity: 0.000000
First Submitted: 2009-12-23 23:19
Last Updated: 2018-02-07 09:54

Latest Comments

galengold commented on 2018-03-03 19:14

To those getting the conflicting files error, see https://bbs.archlinux.org/viewtopic.php?id=156942.

You can do mv /usr/lib64 /usr/lib64.backup and mv /usr/sbin /usr/sbin.backup

ta33ers commented on 2018-02-23 07:37

Has anyone been able to install this since the last update on 20180207

ta33ers commented on 2018-02-18 10:20

I would like to add, I am also receiving the same error message: error: failed to commit transaction (conflicting files) svxlink: /usr/lib64 exists in filesystem svxlink: /usr/sbin exists in filesystem Glendon KG5WXU 73

djringjr commented on 2018-02-17 02:37

When I tried to install this I received the following error:

error: failed to commit transaction (conflicting files) svxlink: /usr/lib64 exists in filesystem svxlink: /usr/sbin exists in filesystem

Is there a work around for this error?

73 David N1EA

sm0svx commented on 2018-01-01 13:39

New upstream release, 17.12, is now available.

freaknils commented on 2017-12-12 09:08

@jtmb: Here it is: https://aur.archlinux.org/packages/svxlink-git/

jtmb commented on 2017-09-24 05:17

Does anyone have some guidance on making an svxlink-git PKGBUILD so I can try the upstream compile fixes that have already been merged?

jtmb commented on 2017-08-23 08:58

I am receiving the same error as sonny and cannot build.

sonny commented on 2017-06-08 13:41

Getting the following error

make[2]: *** [async/audio/CMakeFiles/asyncaudio.dir/build.make:831: async/audio/CMakeFiles/asyncaudio.dir/AsyncAudioDeviceAlsa.cpp.o] Error 1
make[1]: *** [CMakeFiles/Makefile2:223: async/audio/CMakeFiles/asyncaudio.dir/all] Error 2
make: *** [Makefile:130: all] Error 2
==> ERROR: A failure occurred in build().
Aborting...
:: failed to build svxlink package(s)

cnodell commented on 2016-06-28 11:21

When I tried to install this I received the following error:

error: failed to commit transaction (conflicting files)
svxlink: /usr/lib64 exists in filesystem

Not sure if this is a real issue or not but I thought I'd report it regardless. If it matters, qtel installed without issue.

All comments