Package Details: sword-svn 3548-1

Git Clone URL: https://aur.archlinux.org/sword-svn.git (read-only)
Package Base: sword-svn
Description: Libraries for Bible programs - svn-version
Upstream URL: http://www.crosswire.org/sword/
Keywords: bible
Licenses: GPL
Conflicts: sword
Provides: sword
Submitter: haawda
Maintainer: haawda
Last Packager: haawda
Votes: 22
Popularity: 0.013200
First Submitted: 2012-02-18 11:12
Last Updated: 2017-12-10 15:25

Required by (4)

Sources (1)

Latest Comments

haawda commented on 2017-05-18 02:52

I tried to report this to the mailing list, but my mail did not pass the moderator. In the meanwhile I fixed it myself with a patch.

yvand commented on 2017-05-10 19:04

sword-svn fails to install, below is the error:

libtool: compile: g++ -DHAVE_CONFIG_H -I. -I../include -I../include -I/usr/include -DUSE_AUTOTOOLS -DUNIX -Dunix -D__unix__ -DSWICU_DATA=\"/usr/lib/sword/1.7.900_icu_\" -D_FTPLIB_NO_COMPAT -D_FORTIFY_SOURCE=2 -O3 -fPIC -ftemplate-depth=100 -D_ICU_ -DCURLAVAILABLE -DCURLSFTPAVAILABLE -I/usr/include/CLucene/ext -I/usr/lib -DUSELUCENE -DCLUCENE2 -I/usr/lib -DUSEXAPIAN -Wno-address -Wno-nonnull-compare -march=x86-64 -mtune=generic -O2 -pipe -fstack-protector-strong -MT scsuutf8.lo -MD -MP -MF .deps/scsuutf8.Tpo -c ../src/modules/filters/scsuutf8.cpp -fPIC -DPIC -o .libs/scsuutf8.o
../src/modules/filters/scsuutf8.cpp: In member function 'virtual char sword::SCSUUTF8::processText(sword::SWBuf&, const sword::SWKey*, const sword::SWModule*)':
../src/modules/filters/scsuutf8.cpp:139:2: error: 'UnicodeString' was not declared in this scope
UnicodeString utf16Text(text.getRawData(), text.length(), scsuConv, err);
^~~~~~~~~~~~~
../src/modules/filters/scsuutf8.cpp:141:16: error: 'utf16Text' was not declared in this scope
int32_t len = utf16Text.extract(text.getRawData(), text.size(), utf8Conv, err);
^~~~~~~~~
make[1]: *** [Makefile:1608: scsuutf8.lo] Error 1
make[1]: Leaving directory '/tmp/yaourt-tmp-yvand/aur-sword-svn/src/sword/lib'
make: *** [Makefile:623: all-recursive] Error 1

SanskritFritz commented on 2014-12-08 14:13

Dependency icu is already satisfied through clucene/boost-libs.

Alister.Hood commented on 2014-12-08 06:14

This should depend on icu.

haawda commented on 2014-11-12 20:12

I hate that "r" in version numbers. I see no point in having it.

freevryheid commented on 2014-11-11 04:11

Is it possible to set the pkgver in the pkgbuild per guidelines:

https://wiki.archlinux.org/index.php/VCS_PKGBUILD_Guidelines#The_pkgver.28.29_function

haawda commented on 2014-08-24 08:59

Had to set "--without-xz" to the configure switches, build would fail otherwise.

haawda commented on 2014-05-12 18:57

Added xz to the dependencies.

MisterEwok, try building without yaourt.

sinisterstuf commented on 2014-05-12 09:27

Please add automake to makedepends:

@@ -7,7 +7,7 @@
url="http://www.crosswire.org/sword/"
license=('GPL')
depends=('curl' 'clucene' 'swig')
-makedepends=('subversion')
+makedepends=('subversion' 'automake')
provides=('sword')
conflicts=('sword')
source=('sword::svn+https://www.crosswire.org/svn/sword/trunk/')

MisterEwok commented on 2013-08-23 15:39

I'm using "yaourt -Syu --aur" to update my system. It tries to update sword-svn but it has an error. First there are a whole bunch of warnings that look like:

lib/Makefile.am:17: warning: source file '$(bindingsdir)/flatapi.cpp' is in a subdirectory,
lib/Makefile.am:17: but option 'subdir-objects' is disabled

And then it quits at:

checking whether we are cross compiling... configure: error: in `/tmp/yaourt-tmp-philip/aur-sword-svn/src/sword':
configure: error: cannot run C compiled programs.
If you meant to cross compile, use `--host'.
See `config.log' for more details
==> ERROR: A failure occurred in build().
Aborting...
==> ERROR: Makepkg was unable to build sword-svn.


All comments