Package Details: tarquin 4.3.12-1

Git Clone URL: (read-only, click to copy)
Package Base: tarquin
Description: An analysis tool for automatically determining the quantities of molecules present in MR spectroscopy data
Upstream URL:
Licenses: GPL
Submitter: martin3141
Maintainer: None
Last Packager: martin3141
Votes: 1
Popularity: 0.000000
First Submitted: 2019-03-17 11:28 (UTC)
Last Updated: 2019-03-21 20:18 (UTC)

Latest Comments

MarsSeed commented on 2023-08-08 22:24 (UTC)

Is this package still needed?

MarsSeed commented on 2023-08-08 22:24 (UTC) (edited on 2023-08-08 22:26 (UTC) by MarsSeed)

The build fails with hundreds of C++17 related errors like these:

/home/user/.cache/makepkg/tarquin/src/tarquin-4.3.12/src/cvmlib/cvm/src/cvm.h:9523:53: error: ISO C++17 does not allow dynamic 
    exception specifications
 9523 |                                 const int* pnParam) throw (cvm::cvmexception);
      |                                                     ^~~~~

make[2]: *** [cvmlib/cvm/src/CMakeFiles/cvm.dir/build.make:76: cvmlib/cvm/src/CMakeFiles/cvm.dir/arrays.cpp.o] Error 1
make[1]: *** [CMakeFiles/Makefile2:360: cvmlib/cvm/src/CMakeFiles/cvm.dir/all] Error 2
make[1]: *** Waiting for unfinished jobs....
make: *** [Makefile:101: all] Error 2
==> ERROR: A failure occurred in build().
 -> error making: tarquin